TEMP
type: Ontology
auto-generated-by: DAG-Edit 1.419 rev 3
date: 09:08:2005 16:02
default-namespace: zea_mays_anatomy
has_obo_format_version: 1.0
saved-by: gwg
comment: autogenerated-by: DAG-Edit version 1.410
comment: date: Thu Feb 12 16:13:57 CST 2004
comment: saved-by: Leszek
comment: version: $Revision: 1.1 $

definition
type: AnnotationProperty

database_cross_reference
type: AnnotationProperty

has_obo_format_version
type: AnnotationProperty

has_obo_namespace
type: AnnotationProperty

has_related_synonym
type: AnnotationProperty

is a
type: ObjectProperty
has_obo_namespace: zea_mays_anatomy
id: is_a

Part of
type: ObjectProperty
has_obo_namespace: zea_mays_anatomy
id: part_of

Derived/Develops from
type: ObjectProperty
has_obo_namespace: zea_mays_anatomy
id: DERIVED/DEVELOPS_FROM

adaxial
type: Class
subclass of: leaf blade indumentum
has_obo_namespace: zea_mays_anatomy
id: ZEA:0015001

leaf blade indumentum
type: Class
subclass of: Restriction
  on property: Part of
  some values from: leaf blade
has_obo_namespace: zea_mays_anatomy
id: ZEA:0015002

ligule projections
type: Class
subclass of: Restriction
  on property: Part of
  some values from: ligule
definition: The ligule projections occur along the distal edge of the ligule and comprise numerous epidermal cell projections, forming a microscopic 'fringe' of projections.
database_cross_reference: DELTA:Grass Character List
has_obo_namespace: zea_mays_anatomy
has_related_synonym: ciliolate ligule
has_related_synonym: ligule apex
id: ZEA:0015003

Axiom
annotated source: ligule projections
annotated property: definition
annotated target: The ligule projections occur along the distal edge of the ligule and comprise numerous epidermal cell projections, forming a microscopic 'fringe' of projections.
database_cross_reference: MaizeGDB:165572
database_cross_reference: MaizeGDB:60922

lateral vein
type: Class
subclass of: Restriction
  on property: Part of
  some values from: leaf sheath venation
definition: The lateral veins make up the majority of the vasculature of the leaf sheath. They occur on either side of the midvein (which is only distinguishable from the lateral veins on the basis of position).
has_obo_namespace: zea_mays_anatomy
id: ZEA:0015004

Axiom
annotated source: lateral vein
annotated property: definition
annotated target: The lateral veins make up the majority of the vasculature of the leaf sheath. They occur on either side of the midvein (which is only distinguishable from the lateral veins on the basis of position).
database_cross_reference: MaizeGDB:165572
database_cross_reference: MaizeGDB:60922

midvein
type: Class
subclass of: Restriction
  on property: Part of
  some values from: leaf sheath venation
definition: The midvein in the leaf sheath region of the leaf is seemingly the same diameter as the neighboring lateral veins and is indistinguishable from the lateral veins except on the basis of position.
has_obo_namespace: zea_mays_anatomy
id: ZEA:0015005

Axiom
annotated source: midvein
annotated property: definition
annotated target: The midvein in the leaf sheath region of the leaf is seemingly the same diameter as the neighboring lateral veins and is indistinguishable from the lateral veins except on the basis of position.
database_cross_reference: MaizeGDB:60922

bulliform cell
type: Class
subclass of: cell type
has_obo_namespace: zea_mays_anatomy
id: ZEA:0015006

ligule appearance
type: Class
subclass of: Restriction
  on property: Part of
  some values from: ligule
definition: The ligule is a unique line of epidermal tissue and appears to be composed of 'fused hairs'. The ligule is oriented almost perpendicular to the adjacent leaf surface.
has_obo_namespace: zea_mays_anatomy
id: ZEA:0015007

Axiom
annotated source: ligule appearance
annotated property: definition
annotated target: The ligule is a unique line of epidermal tissue and appears to be composed of 'fused hairs'. The ligule is oriented almost perpendicular to the adjacent leaf surface.
database_cross_reference: MaizeGDB:lv (ID# 165572)

short cell
type: Class
subclass of: cell type
definition: silica and cork short cells.
has_obo_namespace: zea_mays_anatomy
id: ZEA:0015008

Axiom
annotated source: short cell
annotated property: definition
annotated target: silica and cork short cells.
database_cross_reference: MaizeGDB:60922

ligule
type: Class
subclass of: Restriction
  on property: Part of
  some values from: juvenile leaf
subclass of: Restriction
  on property: Part of
  some values from: adult leaf
definition: The ligule in Zea mays is a protruding line of tissue on the inner/upper (adaxial) surface of the leaf at the boundary between the leaf-sheath and the leaf blade (lamina) - the ligular region of the leaf. This unique line of epidermal tissue appears to be composed of 'fused hairs'. The ligule is oriented almost perpendicular to the adjacent leaf surface.
database_cross_reference: MaizeDB:64473
has_obo_namespace: zea_mays_anatomy
id: ZEA:0015009

Axiom
annotated source: ligule
annotated property: definition
annotated target: The ligule in Zea mays is a protruding line of tissue on the inner/upper (adaxial) surface of the leaf at the boundary between the leaf-sheath and the leaf blade (lamina) - the ligular region of the leaf. This unique line of epidermal tissue appears to be composed of 'fused hairs'. The ligule is oriented almost perpendicular to the adjacent leaf surface.
database_cross_reference: A. Fahn:(1982). Plant Anatomy , p.244-245 , ISBN 0-08-028029-3
database_cross_reference: Gibbs Russell et al.:(1990). Grasses of Southern Africa , ISBN 0-620-14846-2
database_cross_reference: M. Freeling & B. Lane:1994. The Maize Leaf. In M. Freeling & V. Walbot (eds.) (1994). The Maize Handbook. Springer-Verlag , New York , ISBN 3-540-97826-7
database_cross_reference: MaizeGDB:lv (ID # 165572)

intercostal long cell
type: Class
subclass of: cell type
has_obo_namespace: zea_mays_anatomy
id: ZEA:0015010

leaf blade cuticle
type: Class
subclass of: Restriction
  on property: Part of
  some values from: leaf blade
definition: Provide defn.
database_cross_reference: MaizeDB:45980
has_obo_namespace: zea_mays_anatomy
id: ZEA:0015011

Axiom
annotated source: leaf blade cuticle
annotated property: definition
annotated target: Provide defn.
database_cross_reference: ***:*****

costal long cell
type: Class
subclass of: cell type
has_obo_namespace: zea_mays_anatomy
id: ZEA:0015012

auricular trichomes
type: Class
subclass of: leaf blade auricles
definition: Trichomes (hairs) which are present at the distal and proximal ends of the margin of the auricle.
database_cross_reference: MaizeDB:165572
has_obo_namespace: zea_mays_anatomy
has_related_synonym: auricular setae
id: ZEA:0015013

Axiom
annotated source: auricular trichomes
annotated property: definition
annotated target: Trichomes (hairs) which are present at the distal and proximal ends of the margin of the auricle.
database_cross_reference: MaizeGDB:165572

cell type
type: Class
subclass of: Restriction
  on property: Part of
  some values from: whole plant
has_obo_namespace: zea_mays_anatomy
id: ZEA:0015014

abaxial indumentum
type: Class
subclass of: macrohair
has_obo_namespace: zea_mays_anatomy
id: ZEA:0015015

intermediate vein
type: Class
subclass of: Restriction
  on property: Part of
  some values from: leaf blade venation
definition: A vein that arises from one of the primary intermediate veins and conducts in a basipetal direction.
has_obo_namespace: zea_mays_anatomy
id: ZEA:0015016

Axiom
annotated source: intermediate vein
annotated property: definition
annotated target: A vein that arises from one of the primary intermediate veins and conducts in a basipetal direction.
database_cross_reference: MaizeGDB:165572
database_cross_reference: MaizeGDB:60922

adaxial indumentum
type: Class
subclass of: leaf sheath indumentum
has_obo_namespace: zea_mays_anatomy
id: ZEA:0015017

abaxial
type: Class
subclass of: leaf blade epidermis
has_obo_namespace: zea_mays_anatomy
id: ZEA:0015018

adaxial
type: Class
subclass of: leaf blade epidermis
has_obo_namespace: zea_mays_anatomy
id: ZEA:0015019

prickle hair
type: Class
subclass of: cell type
subclass of: Restriction
  on property: Part of
  some values from: abaxial
subclass of: Restriction
  on property: Part of
  some values from: adaxial
has_obo_namespace: zea_mays_anatomy
id: ZEA:0015020

leaf sheath indumentum
type: Class
subclass of: Restriction
  on property: Part of
  some values from: leaf sheath
has_obo_namespace: zea_mays_anatomy
id: ZEA:0015021

leaf blade margin
type: Class
subclass of: Restriction
  on property: Part of
  some values from: leaf blade
definition: Provide definition
database_cross_reference: MaizeDB:65488
database_cross_reference: XXX:12345
has_obo_namespace: zea_mays_anatomy
has_related_synonym: Leaf margin
id: ZEA:0015022

Axiom
annotated source: leaf blade margin
annotated property: definition
annotated target: Provide definition
database_cross_reference: ****:****

microhair
type: Class
subclass of: cell type
subclass of: Restriction
  on property: Part of
  some values from: abaxial
subclass of: Restriction
  on property: Part of
  some values from: adaxial
definition: Microhairs originate from one of the epidermal cells.... About 15um in length.
has_obo_namespace: zea_mays_anatomy
id: ZEA:0015023

Axiom
annotated source: microhair
annotated property: definition
annotated target: Microhairs originate from one of the epidermal cells.... About 15um in length.
database_cross_reference: MaizeGDB:165572
database_cross_reference: MaizeGDB:60922

leaf sheath
type: Class
subclass of: Restriction
  on property: Part of
  some values from: juvenile leaf
subclass of: Restriction
  on property: Part of
  some values from: adult leaf
definition: The proximal (basal) portion of the leaf that initiates at the culm node and wraps around the stem and extending to the ligule (adaxial surface) and collar (abaxial surface) regions of the leaf. Distal to this junction region is the lamina (leaf blade).
database_cross_reference: MaizeDB:13810
has_obo_namespace: zea_mays_anatomy
id: ZEA:0015024

Axiom
annotated source: leaf sheath
annotated property: definition
annotated target: The proximal (basal) portion of the leaf that initiates at the culm node and wraps around the stem and extending to the ligule (adaxial surface) and collar (abaxial surface) regions of the leaf. Distal to this junction region is the lamina (leaf blade).
database_cross_reference: MaizeGDB:lv (ID # 165572)

auricle epidermis
type: Class
subclass of: leaf blade auricles
definition: The epidermal tissue that is coincident with the auricular region of the lamina.
has_obo_namespace: zea_mays_anatomy
id: ZEA:0015025

Axiom
annotated source: auricle epidermis
annotated property: definition
annotated target: The epidermal tissue that is coincident with the auricular region of the lamina.
database_cross_reference: MaizeGDB:165572
database_cross_reference: MaizeGDB:60922

intermediate vein
type: Class
subclass of: Restriction
  on property: Part of
  some values from: leaf sheath venation
definition: A vein that arises from the midvein or one of the lateral veins. Usually only one intermediate vein can be found between any adjacent pair of lateral veins.
has_obo_namespace: zea_mays_anatomy
id: ZEA:0015026

Axiom
annotated source: intermediate vein
annotated property: definition
annotated target: A vein that arises from the midvein or one of the lateral veins. Usually only one intermediate vein can be found between any adjacent pair of lateral veins.
database_cross_reference: MaizeGDB:165572
database_cross_reference: MaizeGDB:60922

leaf blade
type: Class
subclass of: Restriction
  on property: Part of
  some values from: juvenile leaf
subclass of: Restriction
  on property: Part of
  some values from: adult leaf
definition: Expanded lateral outgrowth of the stem produced in succession from the growing point, and having a bud in its axil. The maize foliar leaf consists of 2 distict parts, the blade (lamina) (a flat portion extending away from the stem (culm), which is the distal part of the whole leaf, and the sheath (a basal part wrapped tightly around the stem), which is the proximal part of the whole leaf. At the junction of blade (lamina) and sheath is an indentation and a hinge of translucent tissue. Each leaf has a pair of auricles. The auricles are triangular portions of leaf tissue that are adjacent to the indentation (junction of leaf sheath with leaf blade). Each leaf has a ligule. The ligule is a thin collar of filmy tissue which grows semi perpendicularly from the junction of the leaf sheath and leaf blade on the adaxial (upper) surface of the leaf.
database_cross_reference: MaizeDB:24740
database_cross_reference: ZEA:0015059
has_obo_namespace: zea_mays_anatomy
has_related_synonym: lamina
id: ZEA:0015027

Axiom
annotated source: leaf blade
annotated property: definition
annotated target: Expanded lateral outgrowth of the stem produced in succession from the growing point, and having a bud in its axil. The maize foliar leaf consists of 2 distict parts, the blade (lamina) (a flat portion extending away from the stem (culm), which is the distal part of the whole leaf, and the sheath (a basal part wrapped tightly around the stem), which is the proximal part of the whole leaf. At the junction of blade (lamina) and sheath is an indentation and a hinge of translucent tissue. Each leaf has a pair of auricles. The auricles are triangular portions of leaf tissue that are adjacent to the indentation (junction of leaf sheath with leaf blade). Each leaf has a ligule. The ligule is a thin collar of filmy tissue which grows semi perpendicularly from the junction of the leaf sheath and leaf blade on the adaxial (upper) surface of the leaf.
database_cross_reference: S. Poethig:1982. In W.F. Sheridan (ed.) , Maize for biological research , p.9-18. Plant Mol. Biol. Assn. , Charlottesville , VA.

phyllotaxy
type: Class
subclass of: leaf blade
definition: Provide a definition for this.
database_cross_reference: MaizeDB:163501
has_obo_namespace: zea_mays_anatomy
has_related_synonym: Arrangement
id: ZEA:0015028

Axiom
annotated source: phyllotaxy
annotated property: definition
annotated target: Provide a definition for this.
database_cross_reference: ZEA:Provide a defn. for this.

primary intermediate vein
type: Class
subclass of: Restriction
  on property: Part of
  some values from: leaf blade venation
subclass of: Restriction
  on property: Part of
  some values from: leaf sheath venation
definition: A vein that arises from the midvein or one of the lateral veins.
has_obo_namespace: zea_mays_anatomy
id: ZEA:0015029

Axiom
annotated source: primary intermediate vein
annotated property: definition
annotated target: A vein that arises from the midvein or one of the lateral veins.
database_cross_reference: MaizeGDB:165572
database_cross_reference: MaizeGDB:60922

lateral vein
type: Class
subclass of: Restriction
  on property: Part of
  some values from: leaf blade venation
definition: One of the many veins which traverse the length of the leaf, running parallel to the midrib.
has_obo_namespace: zea_mays_anatomy
id: ZEA:0015030

Axiom
annotated source: lateral vein
annotated property: definition
annotated target: One of the many veins which traverse the length of the leaf, running parallel to the midrib.
database_cross_reference: MaizeGDB:60922

leaf
type: Class
subclass of: organ
definition: The Zea mays leaf consists of 3 parts: the sheath which envelops the culm; the blade (lamina) which extends from the sheath; the collar and ligule located at the junction of the sheath and the blade (lamina). Ref.: Gibbs Russell et al. 1990, Grasses of southern Africa, p.7; ISBN: 0-620-14846-2.
has_obo_namespace: zea_mays_anatomy
id: ZEA:0015031

Axiom
annotated source: leaf
annotated property: definition
annotated target: The Zea mays leaf consists of 3 parts: the sheath which envelops the culm; the blade (lamina) which extends from the sheath; the collar and ligule located at the junction of the sheath and the blade (lamina). Ref.: Gibbs Russell et al. 1990, Grasses of southern Africa, p.7; ISBN: 0-620-14846-2.
database_cross_reference: MaizeGDB:lv

midvein
type: Class
subclass of: Restriction
  on property: Part of
  some values from: leaf blade venation
has_obo_namespace: zea_mays_anatomy
id: ZEA:0015032

leaf blade venation
type: Class
subclass of: Restriction
  on property: Part of
  some values from: leaf blade
definition: Provide defn.
has_obo_namespace: zea_mays_anatomy
has_related_synonym: Vasculature
id: ZEA:0015033

Axiom
annotated source: leaf blade venation
annotated property: definition
annotated target: Provide defn.
database_cross_reference: 2222:33333

root
type: Class
subclass of: Restriction
  on property: Part of
  some values from: sporophyte
definition: The root system of Zea mays is a complex organ. While most of it arises from the basal portion of the plant below ground, a considerable number of above-ground adventitious roots also contribute significantly to the volume of the root system. below-ground
has_obo_namespace: zea_mays_anatomy
id: ZEA:0015034

Axiom
annotated source: root
annotated property: definition
annotated target: The root system of Zea mays is a complex organ. While most of it arises from the basal portion of the plant below ground, a considerable number of above-ground adventitious roots also contribute significantly to the volume of the root system. below-ground
database_cross_reference: MaizeGDB:lv

leaf blade auricles
type: Class
subclass of: Restriction
  on property: Part of
  some values from: leaf blade
definition: Leaf blade auricles are small appendages (portion of leaf tissue) in the collar area of the leaf (proximal end (base) of the lamina (leaf blade)) immediately lateral to the ligule. In Zea mays the auricles appear to arise from the 'collar' tissue of the leaf blade. Each auricle has an equilateral triangular shape. The base of the triangle forming the proximal margin of the leaf, the upper equilateral side being the boundary of the proximal region of the leaf blade. The lower equilateral side being the boundary of the distal edge of the leaf sheath. There are two auricles on each adult leaf of Zea mays. The auricular tissue extends from the adaxial to the abaxial surfaces of the lamina.
has_obo_namespace: zea_mays_anatomy
id: ZEA:0015035

Axiom
annotated source: leaf blade auricles
annotated property: definition
annotated target: Leaf blade auricles are small appendages (portion of leaf tissue) in the collar area of the leaf (proximal end (base) of the lamina (leaf blade)) immediately lateral to the ligule. In Zea mays the auricles appear to arise from the 'collar' tissue of the leaf blade. Each auricle has an equilateral triangular shape. The base of the triangle forming the proximal margin of the leaf, the upper equilateral side being the boundary of the proximal region of the leaf blade. The lower equilateral side being the boundary of the distal edge of the leaf sheath. There are two auricles on each adult leaf of Zea mays. The auricular tissue extends from the adaxial to the abaxial surfaces of the lamina.
database_cross_reference: ISBN:0620148462
database_cross_reference: MaizeGDB:165572
database_cross_reference: MaizeGDB:60922

Zea mays Plant Structure Ontology
type: Class
definition: The Zea mays Plant Structure Ontology consists of controlled vocabulary terms for Zea mays anatomy (including morphology). Note that the name Plant Structure Ontology is used in preference to Anatomy Ontology as plant scientists differ on the appropriate use of the term 'anatomy'. In the strict sense 'anatomy' includes 'morphology'. However, some plant scientists relate more easily to external features being termed morphology & internal features being termed anatomy. To overcome possible misunderstanding 'Plant Structure' is being used as the preferred term with 'Anatomy (incl. morphology)' as a synonym.
database_cross_reference: maizedb:pldv (ID#165572)
has_obo_namespace: zea_mays_anatomy
has_related_synonym: anatomy (including morphology)
id: ZEA:0015036

Axiom
annotated source: Zea mays Plant Structure Ontology
annotated property: definition
annotated target: The Zea mays Plant Structure Ontology consists of controlled vocabulary terms for Zea mays anatomy (including morphology). Note that the name Plant Structure Ontology is used in preference to Anatomy Ontology as plant scientists differ on the appropriate use of the term 'anatomy'. In the strict sense 'anatomy' includes 'morphology'. However, some plant scientists relate more easily to external features being termed morphology & internal features being termed anatomy. To overcome possible misunderstanding 'Plant Structure' is being used as the preferred term with 'Anatomy (incl. morphology)' as a synonym.
database_cross_reference: MaizeGDB:lv (ID # 165572

whole plant
type: Class
subclass of: Zea mays Plant Structure Ontology
has_obo_namespace: zea_mays_anatomy
id: ZEA:0015037

leaf sheath venation
type: Class
subclass of: Restriction
  on property: Part of
  some values from: leaf sheath
definition: The vascular tissue which forms distinct veins in the leaf sheath. The midvein is seemingly the same diameter as the lateral veins and is indistinguishable from the lateral veins except on the basis of location.
database_cross_reference: MaizeDB:pending
has_obo_namespace: zea_mays_anatomy
has_related_synonym: vasculature
id: ZEA:0015039

Axiom
annotated source: leaf sheath venation
annotated property: definition
annotated target: The vascular tissue which forms distinct veins in the leaf sheath. The midvein is seemingly the same diameter as the lateral veins and is indistinguishable from the lateral veins except on the basis of location.
database_cross_reference: 2222:33333

macrohair
type: Class
subclass of: Restriction
  on property: Part of
  some values from: adaxial indumentum
definition: Trichome produced in midrib region on adaxial surface of mature leaf.
has_obo_namespace: zea_mays_anatomy
id: ZEA:0015040

Axiom
annotated source: macrohair
annotated property: definition
annotated target: Trichome produced in midrib region on adaxial surface of mature leaf.
database_cross_reference: MaizeGDB:60922

leaf blade angle
type: Class
subclass of: leaf blade
definition: Provide defn.
database_cross_reference: MaizeDB:69813
has_obo_namespace: zea_mays_anatomy
has_related_synonym: Leaf angle
id: ZEA:0015041

Axiom
annotated source: leaf blade angle
annotated property: definition
annotated target: Provide defn.
database_cross_reference: ****:*****

leaf blade epidermis
type: Class
subclass of: Restriction
  on property: Part of
  some values from: leaf blade
definition: Provide defn.
database_cross_reference: MaizeDB:104000
has_obo_namespace: zea_mays_anatomy
has_related_synonym: Leaf epidermis
id: ZEA:0015042

Axiom
annotated source: leaf blade epidermis
annotated property: definition
annotated target: Provide defn.
database_cross_reference: ****:*****

leaf blade midrib
type: Class
subclass of: Restriction
  on property: Part of
  some values from: leaf blade
definition: Provide defn.
database_cross_reference: MaizeDB:64474
has_obo_namespace: zea_mays_anatomy
id: ZEA:0015043

Axiom
annotated source: leaf blade midrib
annotated property: definition
annotated target: Provide defn.
database_cross_reference: ****:*****

subsidiary cell
type: Class
subclass of: Restriction
  on property: Part of
  some values from: stomatal complex
has_obo_namespace: zea_mays_anatomy
id: ZEA:0015044

leaf blade color
type: Class
subclass of: leaf blade
definition: Provide defn.
database_cross_reference: MaizeDB:246363
has_obo_namespace: zea_mays_anatomy
has_related_synonym: Leaf color
id: ZEA:0015045

Axiom
annotated source: leaf blade color
annotated property: definition
annotated target: Provide defn.
database_cross_reference: ****:*****

guard cell
type: Class
subclass of: Restriction
  on property: Part of
  some values from: stomatal complex
has_obo_namespace: zea_mays_anatomy
id: ZEA:0015046

leaf blade apex
type: Class
subclass of: Restriction
  on property: Part of
  some values from: leaf blade
definition: Provide defn.
database_cross_reference: MaizeDB:24738
has_obo_namespace: zea_mays_anatomy
has_related_synonym: Leaf tip
id: ZEA:0015047

Axiom
annotated source: leaf blade apex
annotated property: definition
annotated target: Provide defn.
database_cross_reference: ***:*****

stomatal complex
type: Class
subclass of: Restriction
  on property: Part of
  some values from: abaxial
subclass of: Restriction
  on property: Part of
  some values from: adaxial
has_obo_namespace: zea_mays_anatomy
id: ZEA:0015048

macrohair
type: Class
subclass of: microhair
subclass of: Restriction
  on property: Part of
  some values from: adaxial
definition: Trichome found in the midrib region on the adaxial surface of a mature leaf.
has_obo_namespace: zea_mays_anatomy
id: ZEA:0015049

Axiom
annotated source: macrohair
annotated property: definition
annotated target: Trichome found in the midrib region on the adaxial surface of a mature leaf.
database_cross_reference: MaizeGDB:60922

organ
type: Class
subclass of: Restriction
  on property: Part of
  some values from: whole plant
definition: A natural part or structure in a plant, capable of performing some special action (termed its function), which is essential to the life or well-being of the whole; as, the root, stem, leaves etc, are organs of plants.
has_obo_namespace: zea_mays_anatomy
id: ZEA:0015050

Axiom
annotated source: organ
annotated property: definition
annotated target: A natural part or structure in a plant, capable of performing some special action (termed its function), which is essential to the life or well-being of the whole; as, the root, stem, leaves etc, are organs of plants.
database_cross_reference: :http //cancerweb.ncl.ac.uk/cgi-bin/omd?query=organ

leaf sheath oral hairs
type: Class
subclass of: leaf sheath
subclass of: Restriction
  on property: Part of
  some values from: leaf sheath indumentum
definition: The trichomes (hairs) that occur at the margin of the distal end of the leaf sheath - adjacent to the base of the ligule and the proximal edge of the auricular region.
has_obo_namespace: zea_mays_anatomy
id: ZEA:0015051

Axiom
annotated source: leaf sheath oral hairs
annotated property: definition
annotated target: The trichomes (hairs) that occur at the margin of the distal end of the leaf sheath - adjacent to the base of the ligule and the proximal edge of the auricular region.
database_cross_reference: MaizeGDB:165572
database_cross_reference: MaizeGDB:60922

leaf blade collar
type: Class
subclass of: Restriction
  on property: Part of
  some values from: leaf blade
definition: The line of yellow tissue between the leaf sheath and the lamina on the abaxial surface of the leaf (equivalent to the proximal edge of the auricular region).
database_cross_reference: MaizeDB:pending
has_obo_namespace: zea_mays_anatomy
id: ZEA:0015052

Axiom
annotated source: leaf blade collar
annotated property: definition
annotated target: The line of yellow tissue between the leaf sheath and the lamina on the abaxial surface of the leaf (equivalent to the proximal edge of the auricular region).
database_cross_reference: Chapman:ISBN 0851991114

abaxial indumentum
type: Class
subclass of: ligule indumentum
definition: Covering, usually of hairs (trichomes) on the surface.
has_obo_namespace: zea_mays_anatomy
id: ZEA:0015053

Axiom
annotated source: abaxial indumentum
annotated property: definition
annotated target: Covering, usually of hairs (trichomes) on the surface.
database_cross_reference: MaizeGDB:165572

microhair
type: Class
subclass of: Restriction
  on property: Part of
  some values from: adaxial indumentum
definition: Microhairs originate from one of the epidermal cells....
has_obo_namespace: zea_mays_anatomy
id: ZEA:0015054

Axiom
annotated source: microhair
annotated property: definition
annotated target: Microhairs originate from one of the epidermal cells....
database_cross_reference: MaizeGDB:60922

adaxial indumentum
type: Class
subclass of: ligule indumentum
definition: Covering, usually of hairs (trichomes) on the surface.
has_obo_namespace: zea_mays_anatomy
id: ZEA:0015055

Axiom
annotated source: adaxial indumentum
annotated property: definition
annotated target: Covering, usually of hairs (trichomes) on the surface.
database_cross_reference: MaizeGDB:lv 165572

abaxial
type: Class
subclass of: leaf blade indumentum
has_obo_namespace: zea_mays_anatomy
id: ZEA:0015056

ligule indumentum
type: Class
subclass of: Restriction
  on property: Part of
  some values from: ligule
has_obo_namespace: zea_mays_anatomy
id: ZEA:0015057

ligule consistency
type: Class
subclass of: Restriction
  on property: Part of
  some values from: ligule
definition: This descriptor refers to whether the ligule is hyaline, membranous, scarious...
has_obo_namespace: zea_mays_anatomy
id: ZEA:0015058

Axiom
annotated source: ligule consistency
annotated property: definition
annotated target: This descriptor refers to whether the ligule is hyaline, membranous, scarious...
database_cross_reference: DELTA:Grass Character List
database_cross_reference: MaizeGDB:165572

juvenile leaf
type: Class
subclass of: leaf
definition: Juvenile leaves are distinct from adult leaves in maize. The juvenile vs adult status is characterized by particular anatomical traits: wax and hair distribution, presence or absence of epidermal cell types, cell wall shape and biochemistry. The juvenile leaves include the oldest leaves. The first 5 juvenile leaves are representative of the 5 embryonic leaves found in the maize kernel (caryopsis). The distinctness of these 5 embryonic leaves is not yet represented in the ontology. The change from juvenile- phase to adult-phase leaves is gradual.
has_obo_namespace: zea_mays_anatomy
id: ZEA:0015059

Axiom
annotated source: juvenile leaf
annotated property: definition
annotated target: Juvenile leaves are distinct from adult leaves in maize. The juvenile vs adult status is characterized by particular anatomical traits: wax and hair distribution, presence or absence of epidermal cell types, cell wall shape and biochemistry. The juvenile leaves include the oldest leaves. The first 5 juvenile leaves are representative of the 5 embryonic leaves found in the maize kernel (caryopsis). The distinctness of these 5 embryonic leaves is not yet represented in the ontology. The change from juvenile- phase to adult-phase leaves is gradual.
database_cross_reference: Freeling & Lane:The Maize Leaf. In The Maize Handbook , ISBN 0387978267
database_cross_reference: MaizeGDB:lv
database_cross_reference: Sylvester et al.:American Journal of Botany 88(12) 2157-2167 , 2001

adult leaf
type: Class
subclass of: leaf
definition: The adult leaves are above the juvenile (oldest) leaves. Adult leaves are distinct from juvenile leaves in maize. The juvenile vs adult status is characterized by particular anatomical traits: wax and hair distribution, presence or absence of epidermal cell types, cell wall shape and biochemistry. The change from juvenile-phase to adult-phase leaves is gradual.
has_obo_namespace: zea_mays_anatomy
id: ZEA:0015060

Axiom
annotated source: adult leaf
annotated property: definition
annotated target: The adult leaves are above the juvenile (oldest) leaves. Adult leaves are distinct from juvenile leaves in maize. The juvenile vs adult status is characterized by particular anatomical traits: wax and hair distribution, presence or absence of epidermal cell types, cell wall shape and biochemistry. The change from juvenile-phase to adult-phase leaves is gradual.
database_cross_reference: Freeling & Lane:The Maize Leaf. In The Maize Handbook. ISBN 0387978267
database_cross_reference: MaizeGDB:lv
database_cross_reference: Sylvester et al.:American Journal of Botan 88(12) 2157-2167 , 2001

primary root
type: Class
subclass of: root
definition: The primary root (radicle or tap root) is the initial root structure which emerges from the embryo of the caryopsis (kernel/seed). The primary root is formed early during embryogenesis, becoming defined as a distinctive region 10-15 days after pollination. The primary root is enclosed by a protective ensheathing structure, the coleorhiza. A variable number of adventitious lateral roots arise from the primary root (these are not formed during embryogenesis). See 'lateral root' for further information on lateral roots (seminal lateral roots). These lateral roots arise at varying points behind the zone of root hair formation on the primary root. The primary root is always present (except when killed by some injury e.g. freezing).
has_obo_namespace: zea_mays_anatomy
has_related_synonym: radicle
id: ZEA:0015061

Axiom
annotated source: primary root
annotated property: definition
annotated target: The primary root (radicle or tap root) is the initial root structure which emerges from the embryo of the caryopsis (kernel/seed). The primary root is formed early during embryogenesis, becoming defined as a distinctive region 10-15 days after pollination. The primary root is enclosed by a protective ensheathing structure, the coleorhiza. A variable number of adventitious lateral roots arise from the primary root (these are not formed during embryogenesis). See 'lateral root' for further information on lateral roots (seminal lateral roots). These lateral roots arise at varying points behind the zone of root hair formation on the primary root. The primary root is always present (except when killed by some injury e.g. freezing).
database_cross_reference: Feldman , in Freeling & Walbot (eds) , The Maize Handbook , ID # 60920:< new dbxref>
database_cross_reference: MaizeGDB:lv

seminal root system
type: Class
subclass of: root
definition: The seminal root system consists of the adventitious lateral roots which are present in the ungerminated caryopsis (kernel, seed) - they are formed during embryogenesis. The adventitious seminal lateral roots arise from 3 to 7 seminal root primordia. These primordia originate 30-40 days postanthesis, and emerge between the scutellum and the first internode. The adventitious seminal lateral root system, the primary root and its associated adventitious lateral roots, forms a small part of the total root system of the plant. These roots are of greatest importance during the early growth of the seedling before the adventitious crown roots of higher internodes become well established.
has_obo_namespace: zea_mays_anatomy
has_related_synonym: seedling root system
has_related_synonym: seminal lateral roots
has_related_synonym: temporary roots
id: ZEA:0015062

Axiom
annotated source: seminal root system
annotated property: definition
annotated target: The seminal root system consists of the adventitious lateral roots which are present in the ungerminated caryopsis (kernel, seed) - they are formed during embryogenesis. The adventitious seminal lateral roots arise from 3 to 7 seminal root primordia. These primordia originate 30-40 days postanthesis, and emerge between the scutellum and the first internode. The adventitious seminal lateral root system, the primary root and its associated adventitious lateral roots, forms a small part of the total root system of the plant. These roots are of greatest importance during the early growth of the seedling before the adventitious crown roots of higher internodes become well established.
database_cross_reference: Feldman in Freeling & Walbot (eds) , 1994. The Maize Handbook , ID # 60920:< new dbxref>
database_cross_reference: Kiesselbach , ID # 59445:< new dbxref>
database_cross_reference: MaizeGDB:lv
database_cross_reference: Poethig in Sheridan , WF (ed) , 1982. Maize for Biological Research , ID # 25744:< new dbxref>

adventitious root system
type: Class
subclass of: root
definition: The adventitious root system consists of all those roots that arise in the basal intercalary meristem of the lower internodes (above the first internode) of the culm (stem). The adventitious root system comprises the bulk of the lateral roots of the maize plant. There are two spatial components of the adventitious root system. 1. A subterranean (below-ground) origin; 2. An aerial (above-ground) origin. The subterranean adventitious roots are frequently called crown roots because they originate from the basal portion of the growing stem known as the crown. The first crown roots (4-5), arranged in a whorl, appear at the base of the second internode about as soon as the tip of the coleoptile reaches the soil surface. A few of the subsequent higher internodes may have a similar number of crown roots (in whorls), after which the successive internodes have more and larger crown roots up to 2-3 internodes above the soil surface. Note that the crown roots of the adventitious root system may appear to arise from the nodes of the culm but careful inspection will reveal their origin from the very base of the internode, frequently disrupting the leaf sheath tissue that arises from the node immediately below the whorl of crown roots. Those crown roots which are initially aerial in position relative to the soil surface are termed 'brace' or 'prop' roots. Until each prop root reaches the soil, it remains unbranched and relatively rigid, and is usually covered by a mucilaginous substance that protects the aerial part of the root from drying (dessication). Note that once the brace / prop roots enter the soil they produce numerous lateral adventitious roots (see 'root branches'). The subterranean crown roots produce numerous lateral adventitious roots early in their development. The crown roots arising from internodes 2 to approximately 5 tend to grow horizontally for some distance before turning downward. The crown roots from the base of the higher internodes (appearing later in the…
has_obo_namespace: zea_mays_anatomy
has_related_synonym: brace roots
has_related_synonym: crown roots
has_related_synonym: permanent roots
has_related_synonym: prop roots
id: ZEA:0015063

Axiom
annotated source: adventitious root system
annotated property: definition
annotated target: The adventitious root system consists of all those roots that arise in the basal intercalary meristem of the lower internodes (above the first internode) of the culm (stem). The adventitious root system comprises the bulk of the lateral roots of the maize plant. There are two spatial components of the adventitious root system. 1. A subterranean (below-ground) origin; 2. An aerial (above-ground) origin. The subterranean adventitious roots are frequently called crown roots because they originate from the basal portion of the growing stem known as the crown. The first crown roots (4-5), arranged in a whorl, appear at the base of the second internode about as soon as the tip of the coleoptile reaches the soil surface. A few of the subsequent higher internodes may have a similar number of crown roots (in whorls), after which the successive internodes have more and larger crown roots up to 2-3 internodes above the soil surface. Note that the crown roots of the adventitious root system may appear to arise from the nodes of the culm but careful inspection will reveal their origin from the very base of the internode, frequently disrupting the leaf sheath tissue that arises from the node immediately below the whorl of crown roots. Those crown roots which are initially aerial in position relative to the soil surface are termed 'brace' or 'prop' roots. Until each prop root reaches the soil, it remains unbranched and relatively rigid, and is usually covered by a mucilaginous substance that protects the aerial part of the root from drying (dessication). Note that once the brace / prop roots enter the soil they produce numerous lateral adventitious roots (see 'root branches'). The subterranean crown roots produce numerous lateral adventitious roots early in their development. The crown roots arising from internodes 2 to approximately 5 tend to grow horizontally for some distance before turning downward. The crown roots from the base of the higher internodes (appearing later in the…
database_cross_reference: Feldman in Freeling & Walbot (eds) , 1994. The Maize Handbook , ID # 60920:< new dbxref>
database_cross_reference: Kiesselbach , ID # 59445:< new dbxref>
database_cross_reference: MaizeGDB:lv
database_cross_reference: Poethig in Sheridan , WF (ed) , 1982. Maize for Biological Research , ID # 25744:< new dbxref>

seminal lateral root
type: Class
subclass of: seminal root system
subclass of: adventitious root system
definition: Some of the lateral roots of the maize plant comprise the seminal root system. These lateral roots are present in the ungerminated caryopsis (kernel, seed) - they are formed during embryogenesis. The seminal lateral roots arise from 3 to 7 seminal root primordia. These primordia originate 30-40 days post-anthesis, and emerge between the scutellum and the first internode. While these lateral roots comprise the seminal root system they are also part of the adventitious root system.
has_obo_namespace: zea_mays_anatomy
id: ZEA:0015064
comment: Re-defined lateral root & seminal lateral root & re-alligned their parentage to be more accurate. Still not sure about the relationship type for seminal lateral root (is it IS-A?). Same goes for seminal lateral root system relationship to adventitious root system - seems to be both IS-A & Part-Of ???

Axiom
annotated source: seminal lateral root
annotated property: definition
annotated target: Some of the lateral roots of the maize plant comprise the seminal root system. These lateral roots are present in the ungerminated caryopsis (kernel, seed) - they are formed during embryogenesis. The seminal lateral roots arise from 3 to 7 seminal root primordia. These primordia originate 30-40 days post-anthesis, and emerge between the scutellum and the first internode. While these lateral roots comprise the seminal root system they are also part of the adventitious root system.
database_cross_reference: Feldman in Freeling & Walbot (eds) , 1994. The Maize Handbook , ID # 60920:< new dbxref>
database_cross_reference: Kiesselbach , ID # 59445:< new dbxref>
database_cross_reference: MaizeGDB:lv
database_cross_reference: Poethig in Sheridan , WF (ed) , 1982. Maize for Biological Research , ID # 25744:< new dbxref>

lateral root
type: Class
subclass of: Restriction
  on property: Part of
  some values from: primary root
subclass of: Restriction
  on property: Part of
  some values from: adventitious root system
definition: These (adventitious) lateral roots emerge from the primary root (radicle, tap root) at varying points behind the zone of root hair formation. They originate from the pericycle. They are not present during embyogenesis.
has_obo_namespace: zea_mays_anatomy
id: ZEA:0015065

Axiom
annotated source: lateral root
annotated property: definition
annotated target: These (adventitious) lateral roots emerge from the primary root (radicle, tap root) at varying points behind the zone of root hair formation. They originate from the pericycle. They are not present during embyogenesis.
database_cross_reference: Feldman in Freeling & Walbot (eds) , 1994. The Maize Handbook , ID # 60920:< new dbxref>
database_cross_reference: MaizeGDB:lv
database_cross_reference: Poethig in Sheridan , WF (ed) , 1982. Maize for Biological Research , ID # 25744:< new dbxref>

crown roots
type: Class
subclass of: adventitious root system
definition: There are two spatial components of the adventitious root system. 1. A subterranean (below-ground) origin; 2. An aerial (above-ground) origin. The subterranean adventitious roots are frequently called crown roots because they originate from the basal portion of the growing stem known as the crown. The first crown roots (4-5), arranged in a whorl, appear at the base of the second internode about as soon as the tip of the coleoptile reaches the soil surface. A few of the subsequent higher internodes may have a similar number of crown roots (in whorls), after which the successive internodes have more and larger crown roots up to 2-3 internodes above the soil surface. Note that the crown roots of the adventitious root system may appear to arise from the nodes of the culm but careful inspection will reveal their origin from the very base of the internode, frequently disrupting the leaf sheath tissue that arises from the node immediately below the whorl of crown roots. Those crown roots which are initially aerial in position relative to the soil surface are termed 'brace' or 'prop' roots. Until each prop root reaches the soil, it remains unbranched and relatively rigid, and is usually covered by a mucilaginous substance that protects the aerial part of the root from drying (desiccation). Note that once the brace / prop roots enter the soil they produce numerous lateral adventitious roots (see 'root branches'). The subterranean crown roots produce numerous lateral adventitious roots early in their development. The crown roots arising from internodes 2 to approximately 5 tend to grow horizontally for some distance before turning downward. The crown roots from the base of the higher internodes (appearing later in the growing season) grow downward immediately after initiation.
has_obo_namespace: zea_mays_anatomy
id: ZEA:0015066

Axiom
annotated source: crown roots
annotated property: definition
annotated target: There are two spatial components of the adventitious root system. 1. A subterranean (below-ground) origin; 2. An aerial (above-ground) origin. The subterranean adventitious roots are frequently called crown roots because they originate from the basal portion of the growing stem known as the crown. The first crown roots (4-5), arranged in a whorl, appear at the base of the second internode about as soon as the tip of the coleoptile reaches the soil surface. A few of the subsequent higher internodes may have a similar number of crown roots (in whorls), after which the successive internodes have more and larger crown roots up to 2-3 internodes above the soil surface. Note that the crown roots of the adventitious root system may appear to arise from the nodes of the culm but careful inspection will reveal their origin from the very base of the internode, frequently disrupting the leaf sheath tissue that arises from the node immediately below the whorl of crown roots. Those crown roots which are initially aerial in position relative to the soil surface are termed 'brace' or 'prop' roots. Until each prop root reaches the soil, it remains unbranched and relatively rigid, and is usually covered by a mucilaginous substance that protects the aerial part of the root from drying (desiccation). Note that once the brace / prop roots enter the soil they produce numerous lateral adventitious roots (see 'root branches'). The subterranean crown roots produce numerous lateral adventitious roots early in their development. The crown roots arising from internodes 2 to approximately 5 tend to grow horizontally for some distance before turning downward. The crown roots from the base of the higher internodes (appearing later in the growing season) grow downward immediately after initiation.
database_cross_reference: MaizeGDB:lv

subterranean crown roots
type: Class
subclass of: Restriction
  on property: Part of
  some values from: crown roots
definition: The subterranean crown roots are a component of the adventitious root system. They are termed crown roots because they originate from the basal portion of the growing stem known as the crown. The first subterranean crown roots (4-5), arranged in a whorl, appear at the base of the second internode about as soon as the tip of the coleoptile reaches the soil surface. A few of the subsequent higher internodes may have a similar number of crown roots (in whorls), after which the successive internodes have more and larger crown roots up to 2-3 internodes above the soil surface. Note that the crown roots above the soil surface (aerial) are frequently called 'brace' or 'prop' roots. The crown roots emerge from the extreme base of the internode. The subterranean crown roots produce numerous lateral adventitious roots (see 'root branches') early in their development. The crown roots arising from internodes 2 to approximately 5 tend to grow horizontally for some distance before turning downward. The crown roots from the base of the higher internodes (appearing later in the growing season) grow downward immediately after initiation.
has_obo_namespace: zea_mays_anatomy
has_related_synonym: permanent roots
id: ZEA:0015067

Axiom
annotated source: subterranean crown roots
annotated property: definition
annotated target: The subterranean crown roots are a component of the adventitious root system. They are termed crown roots because they originate from the basal portion of the growing stem known as the crown. The first subterranean crown roots (4-5), arranged in a whorl, appear at the base of the second internode about as soon as the tip of the coleoptile reaches the soil surface. A few of the subsequent higher internodes may have a similar number of crown roots (in whorls), after which the successive internodes have more and larger crown roots up to 2-3 internodes above the soil surface. Note that the crown roots above the soil surface (aerial) are frequently called 'brace' or 'prop' roots. The crown roots emerge from the extreme base of the internode. The subterranean crown roots produce numerous lateral adventitious roots (see 'root branches') early in their development. The crown roots arising from internodes 2 to approximately 5 tend to grow horizontally for some distance before turning downward. The crown roots from the base of the higher internodes (appearing later in the growing season) grow downward immediately after initiation.
database_cross_reference: Feldman in Freeling & Walbot (eds) , 1994. The Maize Handbook , ID # 60920:< new dbxref>
database_cross_reference: Kiesselbach , ID # 59445:< new dbxref>
database_cross_reference: MaizeGDB:lv
database_cross_reference: Poethig in Sheridan , WF (ed) , 1982. Maize for Biological Research , ID # 25744:< new dbxref>

prop roots
type: Class
subclass of: Restriction
  on property: Part of
  some values from: crown roots
definition: Prop ('brace') roots are crown roots which have an aerial (above-ground) origin. They emerge from the extreme basal portion of 2-3 internodes above the soil surface. Their emergence frequently disrupts the leaf sheath tissue that arises from the node immediately below the whorl of prop crown roots. Until each prop root reaches the soil, it remains unbranched and relatively rigid, and is usually covered by a mucilaginous substance that protects the aerial part of the root from drying (dessication). Note that once the prop / brace roots enter the soil they produce numerous lateral adventitious roots (see 'root branches'). The crown roots arising from internodes 2 to approximately 5 tend to grow horizontally for some distance before turning downward. The crown roots from the base of the higher internodes (appearing later in the growing season) grow downward immediately after initiation.
has_obo_namespace: zea_mays_anatomy
has_related_synonym: brace roots
id: ZEA:0015068

Axiom
annotated source: prop roots
annotated property: definition
annotated target: Prop ('brace') roots are crown roots which have an aerial (above-ground) origin. They emerge from the extreme basal portion of 2-3 internodes above the soil surface. Their emergence frequently disrupts the leaf sheath tissue that arises from the node immediately below the whorl of prop crown roots. Until each prop root reaches the soil, it remains unbranched and relatively rigid, and is usually covered by a mucilaginous substance that protects the aerial part of the root from drying (dessication). Note that once the prop / brace roots enter the soil they produce numerous lateral adventitious roots (see 'root branches'). The crown roots arising from internodes 2 to approximately 5 tend to grow horizontally for some distance before turning downward. The crown roots from the base of the higher internodes (appearing later in the growing season) grow downward immediately after initiation.
database_cross_reference: Feldman in Freeling & Walbot (eds) , 1994. The Maize Handbook , ID # 60920:< new dbxref>
database_cross_reference: Kiesselbach , ID # 59445:< new dbxref>
database_cross_reference: MaizeGDB:lv
database_cross_reference: Poethig in Sheridan , WF (ed) , 1982. Maize for Biological Research , ID # 25744:< new dbxref>

root branch
type: Class
subclass of: Restriction
  on property: Part of
  some values from: seminal lateral root
subclass of: Restriction
  on property: Part of
  some values from: lateral root
subclass of: Restriction
  on property: Part of
  some values from: subterranean crown roots
subclass of: Restriction
  on property: Part of
  some values from: prop roots
definition: A root branch is an adventitious root that emerges from any of the various types of lateral root. Root branches arise at varying points behind (posterior to) the zone of root hair formation on the primary root. Root branches emerge from the surface of the main roots (the various types of lateral roots) at irregular intervals. When a root branches, the initial of each branch is formed from cells of the pericycle. Via cell division a bulging hemispherical mass of meristematic tissue is formed. The outer part of this forms the beginning of the rootcap, while the cells of the growing point are near the flat basal part of the hemispherical mass. During elongation the new root branch is forced through the adjoining tissues of the cortex of the originating root and emerges at the surface. As the xylem and phloem tissues are differentiated in the root branch they become joined to those of the originating root.
has_obo_namespace: zea_mays_anatomy
id: ZEA:0015069

Axiom
annotated source: root branch
annotated property: definition
annotated target: A root branch is an adventitious root that emerges from any of the various types of lateral root. Root branches arise at varying points behind (posterior to) the zone of root hair formation on the primary root. Root branches emerge from the surface of the main roots (the various types of lateral roots) at irregular intervals. When a root branches, the initial of each branch is formed from cells of the pericycle. Via cell division a bulging hemispherical mass of meristematic tissue is formed. The outer part of this forms the beginning of the rootcap, while the cells of the growing point are near the flat basal part of the hemispherical mass. During elongation the new root branch is forced through the adjoining tissues of the cortex of the originating root and emerges at the surface. As the xylem and phloem tissues are differentiated in the root branch they become joined to those of the originating root.
database_cross_reference: Kiesselbach , ID # 59445:< new dbxref>
database_cross_reference: MaizeGDB:lv

lateral branch internode
type: Class
subclass of: Restriction
  on property: Part of
  some values from: lateral branch
definition: The lateral branch internode is the region of the lateral branch which is bounded by a lateral branch node at each end. Lateral branch internodes are an integral part of the structure of the lateral branches (ear shoots). Lateral branch internodes are not biologically homologous with culm internodes, although they are colloquially referred to as 'internodes'. Notwithstanding this non-homology, the general anatomical structure of a typical internode consists of the following: a pithy interior comprised mainly of parenchyma with vascular bundles distributed throughout (as is typical of monocot stem vascular anatomy). In cross section (transverse section) the epidermis is the outer single layer of cells. The walls of the epidermal cells are considerably thickened, lignified and silicified. Immediately below the epidermis is a layer of sclerenchyma which varies from 1-10 cells in thickness. This sclerenchyma tissue does not form a continuous band underneath the epidermis but forms longitudinal bands or strips around the peripheral vascular bundles, alternating with strips of parenchyma beneath the rows of stomata. Within this discontinuous band of sclerenchyma are several rows of vascular bundles, each surrounded by a large amount of sclerenchyma. The peripheral bundles are smaller and are spaced much closer than those in the central part of the internode (in cross section) and are separated from each other and from the peripheral sclerenchyma by narrow tracts of parenchyma. The non-peripheral vascular bundles are surrounded by a bundle sheath, the cells of which are lignified and sclerenchymatous. The sclerenchymatous bundle sheath is much more developed opposite the phloem and xylem of each vascular bundle, forming phloem and xylem caps.
database_cross_reference: maizedb:XXXXX
has_obo_namespace: zea_mays_anatomy
has_related_synonym: ear shoot internode
has_related_synonym: internode
id: ZEA:0015070

Axiom
annotated source: lateral branch internode
annotated property: definition
annotated target: The lateral branch internode is the region of the lateral branch which is bounded by a lateral branch node at each end. Lateral branch internodes are an integral part of the structure of the lateral branches (ear shoots). Lateral branch internodes are not biologically homologous with culm internodes, although they are colloquially referred to as 'internodes'. Notwithstanding this non-homology, the general anatomical structure of a typical internode consists of the following: a pithy interior comprised mainly of parenchyma with vascular bundles distributed throughout (as is typical of monocot stem vascular anatomy). In cross section (transverse section) the epidermis is the outer single layer of cells. The walls of the epidermal cells are considerably thickened, lignified and silicified. Immediately below the epidermis is a layer of sclerenchyma which varies from 1-10 cells in thickness. This sclerenchyma tissue does not form a continuous band underneath the epidermis but forms longitudinal bands or strips around the peripheral vascular bundles, alternating with strips of parenchyma beneath the rows of stomata. Within this discontinuous band of sclerenchyma are several rows of vascular bundles, each surrounded by a large amount of sclerenchyma. The peripheral bundles are smaller and are spaced much closer than those in the central part of the internode (in cross section) and are separated from each other and from the peripheral sclerenchyma by narrow tracts of parenchyma. The non-peripheral vascular bundles are surrounded by a bundle sheath, the cells of which are lignified and sclerenchymatous. The sclerenchymatous bundle sheath is much more developed opposite the phloem and xylem of each vascular bundle, forming phloem and xylem caps.
database_cross_reference: MaizeGDB:lv (ID # 165572)

lateral branch axillary bud
type: Class
subclass of: Restriction
  on property: Part of
  some values from: lateral branch
definition: a lateral branch axillary (lateral) bud is found in the axil of each of the husk leaves and the prophyll, which arise from the lateral branch nodes of the shank (proximal end of the lateral (axillary) branch(es)). All of the lateral branch axillary buds remain dormant throughout the life-span of the Zea mays plant.
database_cross_reference: maizedb:pldv (ID#165572)
has_obo_namespace: zea_mays_anatomy
has_related_synonym: axillary bud
id: ZEA:0015071

Axiom
annotated source: lateral branch axillary bud
annotated property: definition
annotated target: a lateral branch axillary (lateral) bud is found in the axil of each of the husk leaves and the prophyll, which arise from the lateral branch nodes of the shank (proximal end of the lateral (axillary) branch(es)). All of the lateral branch axillary buds remain dormant throughout the life-span of the Zea mays plant.
database_cross_reference: MaizeGDB:59445
database_cross_reference: MaizeGDB:60893
database_cross_reference: MaizeGDB:lv (ID # 165572)

culm
type: Class
subclass of: organ
definition: the culm is equivalent to the stalk of the Zea mays plant.
has_obo_namespace: zea_mays_anatomy
id: ZEA:0015072

Axiom
annotated source: culm
annotated property: definition
annotated target: the culm is equivalent to the stalk of the Zea mays plant.
database_cross_reference: MaizeGDB:58047

lateral branch
type: Class
subclass of: organ
definition: A lateral branch (often referred to as an ear shoot) of the corn plant bears the female inflorescence (flowering system). Each lateral branch arises from the development of a lateral (axillary) bud, adjacent to one of the nodes of the culm. The lateral branch is subtended by a leaf. After pollination via the silks and fertilization of the ovule within each functionally female floret, the lateral branch develops into the typical ear. The lateral branch arises from the culm (main stem/stalk) at a node. The portion of the lateral branch below the 'ear' is called the shank. The axillary buds arising from nodes above the soil surface terminate in a pistillate inflorescence (ear). Usually all soon degenerate except the upper one or two located about midway up the culm. The amount of growth before disintegration (senescence) varies as the axillary buds may either die without much development or form 'ears' several centimeters long which resemble the functional ears, until they senesce.
database_cross_reference: maizedb:pldv (ID#165572
database_cross_reference: maizedb:pldv (ID#165572)
has_obo_namespace: zea_mays_anatomy
has_related_synonym: axillary branch
has_related_synonym: ear shoot
id: ZEA:0015073

Axiom
annotated source: lateral branch
annotated property: definition
annotated target: A lateral branch (often referred to as an ear shoot) of the corn plant bears the female inflorescence (flowering system). Each lateral branch arises from the development of a lateral (axillary) bud, adjacent to one of the nodes of the culm. The lateral branch is subtended by a leaf. After pollination via the silks and fertilization of the ovule within each functionally female floret, the lateral branch develops into the typical ear. The lateral branch arises from the culm (main stem/stalk) at a node. The portion of the lateral branch below the 'ear' is called the shank. The axillary buds arising from nodes above the soil surface terminate in a pistillate inflorescence (ear). Usually all soon degenerate except the upper one or two located about midway up the culm. The amount of growth before disintegration (senescence) varies as the axillary buds may either die without much development or form 'ears' several centimeters long which resemble the functional ears, until they senesce.
database_cross_reference: MaizeGDB:232442
database_cross_reference: MaizeGDB:59445
database_cross_reference: MaizeGDB:lv (ID # 165572)

shank
type: Class
subclass of: Restriction
  on property: Part of
  some values from: lateral branch
definition: The shank is the portion of the lateral branch below the ear. 8-14 modified leaves, called husks, are arranged up the shank in an alternate pattern and surround the developing ear. The basal husk leaf is termed the prophyll and is not homologous with the other husk leaves. Each husk leaf arises from a node along the length of the lateral branch. A dormant lateral (axillary) bud is found in the axil of each husk leaf.
has_obo_namespace: zea_mays_anatomy
id: ZEA:0015074

Axiom
annotated source: shank
annotated property: definition
annotated target: The shank is the portion of the lateral branch below the ear. 8-14 modified leaves, called husks, are arranged up the shank in an alternate pattern and surround the developing ear. The basal husk leaf is termed the prophyll and is not homologous with the other husk leaves. Each husk leaf arises from a node along the length of the lateral branch. A dormant lateral (axillary) bud is found in the axil of each husk leaf.
database_cross_reference: MaizeGDB:165572
database_cross_reference: MaizeGDB:232442

cob
type: Class
subclass of: Restriction
  on property: Part of
  some values from: lateral branch
subclass of: Restriction
  on property: Part of
  some values from: ear (functionally female inflorescence)
definition: The central axis/core of the 'ear' (distal end of the lateral branch/ear shoot) upon which the kernels (caryopses) are borne. The cob is similar to the central spike of the tassel (male inflorescence) in that it produces multiple rows of paired spikelets (polystichous phyllotaxy).
database_cross_reference: ZEA:0015084
database_cross_reference: maizedb:59445 (p. 53)
has_obo_namespace: zea_mays_anatomy
has_related_synonym: rachis
id: ZEA:0015075

Axiom
annotated source: cob
annotated property: definition
annotated target: The central axis/core of the 'ear' (distal end of the lateral branch/ear shoot) upon which the kernels (caryopses) are borne. The cob is similar to the central spike of the tassel (male inflorescence) in that it produces multiple rows of paired spikelets (polystichous phyllotaxy).
database_cross_reference: MaizeGDB:165572
database_cross_reference: MaizeGDB:60893

culm node
type: Class
subclass of: Restriction
  on property: Part of
  some values from: culm
definition: The culm nodes are regions of dense tissue appearing as slightly swollen regions along the length of the culm. The culms of typical eastern Nebraska corn plants consist of about 24 culm nodes (alternating with culm internodes). The number of culm nodes may vary according to regional type and environmental effects. Approximately 8 culm internodes remain very short (contracted) and subterranean, forming an inverted cone-shaped basal end of the culm (stem) known as the crown. Culm nodes are an integral part of the structure of the culm (stalk). Culm nodes are not biologically homologous with lateral branch nodes, although they are colloquially referred to as 'nodes'. Notwithstanding this non-homology, the general anatomical structure of a typical node consists of the following: the structure of nodes is more complicated than that of the internodes due to the branching and cross connections between the vascular bundles forming the nodal complex. The vascular bundles with their cross connections fill up most of the space of the node, so there is relatively little parenchyma. In the zone of leaf attachment at the culm nodes, the epidermis of the adjacent culm internodes becomes continuous over the attached leaf sheath. Not much elongation occurs in the culm nodes and no protoxylem lacunae are formed. The arrangement of the tissues in the vascular bundles is more irregular and no bundle caps are formed in the endosperm adjacent to the vascular tissue. As the vascular bundles enter a culm node from below, they enlarge in diameter and form cross connections, creating a tangled network which extends for several millimeters up into the adjacent internode. Many of the vascular bundles branch as they pass through the culm node, while some turn abruptly sideways for a short distance. Some vascular bundles pass from the culm node into the base of the leaf sheath.
database_cross_reference: maizedb:64470
has_obo_namespace: zea_mays_anatomy
has_related_synonym: node
id: ZEA:0015076

Axiom
annotated source: culm node
annotated property: definition
annotated target: The culm nodes are regions of dense tissue appearing as slightly swollen regions along the length of the culm. The culms of typical eastern Nebraska corn plants consist of about 24 culm nodes (alternating with culm internodes). The number of culm nodes may vary according to regional type and environmental effects. Approximately 8 culm internodes remain very short (contracted) and subterranean, forming an inverted cone-shaped basal end of the culm (stem) known as the crown. Culm nodes are an integral part of the structure of the culm (stalk). Culm nodes are not biologically homologous with lateral branch nodes, although they are colloquially referred to as 'nodes'. Notwithstanding this non-homology, the general anatomical structure of a typical node consists of the following: the structure of nodes is more complicated than that of the internodes due to the branching and cross connections between the vascular bundles forming the nodal complex. The vascular bundles with their cross connections fill up most of the space of the node, so there is relatively little parenchyma. In the zone of leaf attachment at the culm nodes, the epidermis of the adjacent culm internodes becomes continuous over the attached leaf sheath. Not much elongation occurs in the culm nodes and no protoxylem lacunae are formed. The arrangement of the tissues in the vascular bundles is more irregular and no bundle caps are formed in the endosperm adjacent to the vascular tissue. As the vascular bundles enter a culm node from below, they enlarge in diameter and form cross connections, creating a tangled network which extends for several millimeters up into the adjacent internode. Many of the vascular bundles branch as they pass through the culm node, while some turn abruptly sideways for a short distance. Some vascular bundles pass from the culm node into the base of the leaf sheath.
database_cross_reference: MaizeGDB:59445
database_cross_reference: MaizeGDB:lv (ID # 165572)

prophyll
type: Class
subclass of: leaf
subclass of: Restriction
  on property: Part of
  some values from: lateral branch
definition: The lowermost leaf on the short lateral (axillary) branch (shank) bearing the ear. The prophyll arises from the lateral (axillary) branch from the most proximal node and is positioned adjacent to the internode of the main culm. The prophyll is distinct from the husk leaves (non-homologous) in having two apices and two distinct midribs (keels; bikeeled).
has_obo_namespace: zea_mays_anatomy
id: ZEA:0015077

Axiom
annotated source: prophyll
annotated property: definition
annotated target: The lowermost leaf on the short lateral (axillary) branch (shank) bearing the ear. The prophyll arises from the lateral (axillary) branch from the most proximal node and is positioned adjacent to the internode of the main culm. The prophyll is distinct from the husk leaves (non-homologous) in having two apices and two distinct midribs (keels; bikeeled).
database_cross_reference: MaizeGDB:Clayton & Renvoiz ref ID #
database_cross_reference: MaizeGDB:lv (ID # 165572)

husk
type: Class
subclass of: leaf
subclass of: Restriction
  on property: Part of
  some values from: lateral branch
definition: The husks are modified leaves which arise from the short lateral (axillary) branch (shank) bearing the ear. They surround the developing ear. The lower (outer) husks are arranged in a distichous pattern (opposite rows and alternate occurrence, like the foliar leaves) while the upper (inner) husks are polystichous in arrangement. Husks are considered to be somewhat homologous with the adult and juvenile leaves (foliar leaves). Vestiges of the ligular region and lamina (husk leaf, flag leaf) of the husk may be present. Some strains of maize (Zea mays) (e.g. sweet corn) produce husks with a prominent ligule and husk leaf (lamina), which are sometimes called "flag leaves". Husks are relatively thin and flat, unlike the adult and juvenile foliar leaves. The sheaths of the husks are much broader and thinner than the sheaths of the foliar (ordinary) leaves. The venation lacks the presence of a distinct midvein, while lateral veins predominate throughout the husk. Each husk is attached to a unique lateral branch node on the shank (growing lateral (axillary) branch) of the ear. The lowermost husk on the shank, between the shank and the adjacent internode of the main culm, is a prophyll (ZEA:15077). It is easily confused as being a husk but the prophyll is not homologous with a husk. Note that the term husk is colloquially used for the modified leaf tissue which surrounds the ear and the term is seldom associated with husk ligule and husk leaf (flag leaf). However, botanically, the term husk should be used for the entire structure (fide Kiesselbach, 1949), comprising the husk sheath, husk ligule and husk leaf (the latter components frequently being very diminutive). The perspective that husks are somewhat homologous with the adult and juvenile leaves justifies the usage of the term husk sheath for the predominant portion of the husk which surrounds the ear.
has_obo_namespace: zea_mays_anatomy
id: ZEA:0015078

Axiom
annotated source: husk
annotated property: definition
annotated target: The husks are modified leaves which arise from the short lateral (axillary) branch (shank) bearing the ear. They surround the developing ear. The lower (outer) husks are arranged in a distichous pattern (opposite rows and alternate occurrence, like the foliar leaves) while the upper (inner) husks are polystichous in arrangement. Husks are considered to be somewhat homologous with the adult and juvenile leaves (foliar leaves). Vestiges of the ligular region and lamina (husk leaf, flag leaf) of the husk may be present. Some strains of maize (Zea mays) (e.g. sweet corn) produce husks with a prominent ligule and husk leaf (lamina), which are sometimes called "flag leaves". Husks are relatively thin and flat, unlike the adult and juvenile foliar leaves. The sheaths of the husks are much broader and thinner than the sheaths of the foliar (ordinary) leaves. The venation lacks the presence of a distinct midvein, while lateral veins predominate throughout the husk. Each husk is attached to a unique lateral branch node on the shank (growing lateral (axillary) branch) of the ear. The lowermost husk on the shank, between the shank and the adjacent internode of the main culm, is a prophyll (ZEA:15077). It is easily confused as being a husk but the prophyll is not homologous with a husk. Note that the term husk is colloquially used for the modified leaf tissue which surrounds the ear and the term is seldom associated with husk ligule and husk leaf (flag leaf). However, botanically, the term husk should be used for the entire structure (fide Kiesselbach, 1949), comprising the husk sheath, husk ligule and husk leaf (the latter components frequently being very diminutive). The perspective that husks are somewhat homologous with the adult and juvenile leaves justifies the usage of the term husk sheath for the predominant portion of the husk which surrounds the ear.
database_cross_reference: MaizeGDB:Clayton & Renvoize ref ID #
database_cross_reference: MaizeGDB:kiesselbach (ID# 59445)
database_cross_reference: MaizeGDB:lv (ID # 165572)
database_cross_reference: http://www.harcourt.com/dictionary/def/4/9/6/3/4963600.html

culm internode
type: Class
subclass of: Restriction
  on property: Part of
  some values from: culm
definition: The culm internode is the region of the culm which is bounded by a culm node at each end. Culm internodes are an integral part of the structure of the culm. Typically the culm internodes are considered homologous with lateral branch internodes of the lateral branches (ear shoots). However, these two types of internodes are biologically distinct (non-homologous). Notwithstanding this non-homology, the general anatomical structure of a typical internode consists of the following: a pithy interior comprised mainly of parenchyma with vascular bundles distributed throughout (as is typical of monocot stem vascular anatomy). In cross section (transverse section) the epidermis is the outer single layer of cells. The walls of the epidermal cells are considerably thickened, lignified and silicified. Stomata are present in the epidermis but are less abundant than in the epidermis of leaves. Immediately below the epidermis is a layer of sclerenchyma which varies from 1-10 cells in thickness. This sclerenchyma tissue does not form a continuous band underneath the epidermis but forms longitudinal bands or strips around the peripheral vascular bundles, alternating with strips of parenchyma beneath the rows of stomata. Within this discontinuous band of sclerenchyma are several rows of vascular bundles, each surrounded by a large amount of sclerenchyma. The peripheral bundles are smaller and are spaced much closer than those in the central part of the internode (in cross section) and are separated from each other and from the peripheral sclerenchyma by narrow tracts of parenchyma. The non-peripheral vascular bundles are surrounded by a bundle sheath, the cells of which are lignified and sclerenchymatous. The sclerenchymatous bundle sheath is much more developed opposite the phloem and xylem of each vascular bundle, forming phloem and xylem caps.
database_cross_reference: maizedb:XXXXX
has_obo_namespace: zea_mays_anatomy
has_related_synonym: internode
id: ZEA:0015079

Axiom
annotated source: culm internode
annotated property: definition
annotated target: The culm internode is the region of the culm which is bounded by a culm node at each end. Culm internodes are an integral part of the structure of the culm. Typically the culm internodes are considered homologous with lateral branch internodes of the lateral branches (ear shoots). However, these two types of internodes are biologically distinct (non-homologous). Notwithstanding this non-homology, the general anatomical structure of a typical internode consists of the following: a pithy interior comprised mainly of parenchyma with vascular bundles distributed throughout (as is typical of monocot stem vascular anatomy). In cross section (transverse section) the epidermis is the outer single layer of cells. The walls of the epidermal cells are considerably thickened, lignified and silicified. Stomata are present in the epidermis but are less abundant than in the epidermis of leaves. Immediately below the epidermis is a layer of sclerenchyma which varies from 1-10 cells in thickness. This sclerenchyma tissue does not form a continuous band underneath the epidermis but forms longitudinal bands or strips around the peripheral vascular bundles, alternating with strips of parenchyma beneath the rows of stomata. Within this discontinuous band of sclerenchyma are several rows of vascular bundles, each surrounded by a large amount of sclerenchyma. The peripheral bundles are smaller and are spaced much closer than those in the central part of the internode (in cross section) and are separated from each other and from the peripheral sclerenchyma by narrow tracts of parenchyma. The non-peripheral vascular bundles are surrounded by a bundle sheath, the cells of which are lignified and sclerenchymatous. The sclerenchymatous bundle sheath is much more developed opposite the phloem and xylem of each vascular bundle, forming phloem and xylem caps.
database_cross_reference: MaizeGDB:59445
database_cross_reference: MaizeGDB:lv (ID # 165572)

lateral branch node
type: Class
subclass of: Restriction
  on property: Part of
  some values from: lateral branch
definition: The lateral branch nodes are regions of dense tissue appearing as slightly swollen regions along the length of the lateral branch. Lateral branch nodes are an integral part of the structure of the lateral branchs (ear shoots). Lateral branch internodes are not biologically homologous with culm nodes, although they are colloquially referred to as 'nodes'. Notwithstanding this non-homology, the general anatomical structure of a typical node consists of the following: the structure of nodes is more complicated than that of the internodes due to the branching and cross connections between the vascular bundles forming the nodal complex. The vascular bundles with their cross connections fill up most of the space of the node, so there is relatively little parenchyma. In the zone of husk and prophyll attachment at the lateral branch nodes, the epidermis of the adjacent lateral branch internodes becomes continuous over the prophyll and husk. Not much elongation occurs in the lateral branch nodes and no protoxylem lacunae are formed. The arrangement of the tissues in the vascular bundles is more irregular and no bundle caps are formed in the endosperm adjacent to the vascular tissue. As the vascular bundles enter a lateral branch node from below, they enlarge in diameter and form cross connections, creating a tangled network which extends for several millimeters along the length of the lateral branch. Many of the vascular bundles branch as they pass through the lateral branch node, while some turn abruptly sideways for a short distance. Some vascular bundles pass from the lateral branch node into the base of the prophyll of the sheathing base of the husk leaf.
database_cross_reference: maizedb:XXXXX
has_obo_namespace: zea_mays_anatomy
has_related_synonym: ear shoot node
has_related_synonym: node
id: ZEA:0015080

Axiom
annotated source: lateral branch node
annotated property: definition
annotated target: The lateral branch nodes are regions of dense tissue appearing as slightly swollen regions along the length of the lateral branch. Lateral branch nodes are an integral part of the structure of the lateral branchs (ear shoots). Lateral branch internodes are not biologically homologous with culm nodes, although they are colloquially referred to as 'nodes'. Notwithstanding this non-homology, the general anatomical structure of a typical node consists of the following: the structure of nodes is more complicated than that of the internodes due to the branching and cross connections between the vascular bundles forming the nodal complex. The vascular bundles with their cross connections fill up most of the space of the node, so there is relatively little parenchyma. In the zone of husk and prophyll attachment at the lateral branch nodes, the epidermis of the adjacent lateral branch internodes becomes continuous over the prophyll and husk. Not much elongation occurs in the lateral branch nodes and no protoxylem lacunae are formed. The arrangement of the tissues in the vascular bundles is more irregular and no bundle caps are formed in the endosperm adjacent to the vascular tissue. As the vascular bundles enter a lateral branch node from below, they enlarge in diameter and form cross connections, creating a tangled network which extends for several millimeters along the length of the lateral branch. Many of the vascular bundles branch as they pass through the lateral branch node, while some turn abruptly sideways for a short distance. Some vascular bundles pass from the lateral branch node into the base of the prophyll of the sheathing base of the husk leaf.
database_cross_reference: MaizeGDB:59445
database_cross_reference: MaizeGDB:lv (ID # 165572)

culm axillary bud
type: Class
subclass of: Restriction
  on property: Part of
  some values from: culm
definition: A culm axillary (lateral) bud is found in the axil of each leaf arising from the culm nodes. Most of the culm axillary buds remain dormant throughout the life-span of the Zea mays plant. It is usual for only the upper two culm axillary buds to each develop into a lateral branch bearing an ear (pistillate inflorescence).
database_cross_reference: maizedb:XXXXX
has_obo_namespace: zea_mays_anatomy
has_related_synonym: axillary bud
has_related_synonym: lateral bud
id: ZEA:0015081

Axiom
annotated source: culm axillary bud
annotated property: definition
annotated target: A culm axillary (lateral) bud is found in the axil of each leaf arising from the culm nodes. Most of the culm axillary buds remain dormant throughout the life-span of the Zea mays plant. It is usual for only the upper two culm axillary buds to each develop into a lateral branch bearing an ear (pistillate inflorescence).
database_cross_reference: MaizeGDB:59445
database_cross_reference: MaizeGDB:60893
database_cross_reference: MaizeGDB:lv (ID # 165572)

mesocotyl
type: Class
subclass of: culm internode
definition: The mesocotyl is the first culm internode of the maize culm. The mesocotyl is the culm internode below the plumule, between the coleoptile node and the scutellar node. This first culm internode is a very characteristic and unique feature of the Poaceae (alt. Gramineae). The first culm internode is frequently termed the 'mesocotyl' in the literature. This first culm internode is not evident 15 days after pollination, when the coleoptile node is virtually in contact with the scutellar node. Subsequent intercalary growth results in considerable lengthening of the first culm internode (mesocotyl) in the embryo. "The internode between the scutellar node and coeoptile in the embryo and seedling of Poaceae" (K. Esau. 1977. The Anatomy of Seed Plants, John Wiley & Sons)
has_obo_namespace: zea_mays_anatomy
id: ZEA:0015082

Axiom
annotated source: mesocotyl
annotated property: definition
annotated target: The mesocotyl is the first culm internode of the maize culm. The mesocotyl is the culm internode below the plumule, between the coleoptile node and the scutellar node. This first culm internode is a very characteristic and unique feature of the Poaceae (alt. Gramineae). The first culm internode is frequently termed the 'mesocotyl' in the literature. This first culm internode is not evident 15 days after pollination, when the coleoptile node is virtually in contact with the scutellar node. Subsequent intercalary growth results in considerable lengthening of the first culm internode (mesocotyl) in the embryo. "The internode between the scutellar node and coeoptile in the embryo and seedling of Poaceae" (K. Esau. 1977. The Anatomy of Seed Plants, John Wiley & Sons)
database_cross_reference: MaizeGDB:208059
database_cross_reference: MaizeGDB:lv (ID # 165572)

leaf base attachment
type: Class
subclass of: Restriction
  on property: Part of
  some values from: leaf sheath
definition: The attachment of the leaf to the node of the culm is via the base of the leaf sheath. The attachment of the leaf base is not in a circle but in a short spiral extending a little more than once around the culm (stem). The edge of the leaf which is attached lower on the culm (at a node) overlaps the other edge of the leaf which is attached to the culm slightly higher up. Note that the pattern of overlap alternates between successive leaves - each leaf sheath is rolled around the culm in the opposite direction from that of the preceding leaf.
has_obo_namespace: zea_mays_anatomy
id: ZEA:0015083

Axiom
annotated source: leaf base attachment
annotated property: definition
annotated target: The attachment of the leaf to the node of the culm is via the base of the leaf sheath. The attachment of the leaf base is not in a circle but in a short spiral extending a little more than once around the culm (stem). The edge of the leaf which is attached lower on the culm (at a node) overlaps the other edge of the leaf which is attached to the culm slightly higher up. Note that the pattern of overlap alternates between successive leaves - each leaf sheath is rolled around the culm in the opposite direction from that of the preceding leaf.
database_cross_reference: MaizeGDB:59445
database_cross_reference: MaizeGDB:lv (ID # 165572)

ear (functionally female inflorescence)
type: Class
subclass of: Restriction
  on property: Part of
  some values from: lateral branch
definition: The 'ear' is the distal part of a lateral (axillary) branch and bears the functionally-female florets in a highly contracted inflorescence. The upper one or two culm axillary buds (associated with the nodes of the culm (stalk)), located about midway on the culm, develop fully into short lateral branches, each terminating in a developing ear capable of producing mature kernels (caryopses). Each of the culm axillary buds is covered with about 8-14 modified leaves called husks, and a prophyll (the most basal modified leaf on the lateral branch). The ear branch (lateral branch, shank) consists of nodes and short internodes. The ear itself does not have lateral branches but its thick axis (called the cob), is similar to the central spike of the tassel in that it produces multiple longitudinal rows of paired spikelets (polystichous phyllotaxy). Each spikelet is ensheathed (enclosed) by a pair of glumes and contains only one functionally-female floret. Although two florets are initiated during spikelet ontogeny, only the upper floret develops; the lower floret aborts at an early stage of development. Both florets within a spikelet produce a lemma, but usually only the upper floret produces a palea. The palea of the lower floret either does not initiate or remains rudimentary. Each functionally-female floret produces an ovary with an elongated silk (style) covered with hairs (trichomes). Note that the culm axillary buds, which are not appropriately placed for full development, degenerate at an early stage. The amount of growth before degeneration/senescence occurs varies, as the buds may either die without much development or form ears several centimeters long, which resemble the functional ears until they senesce (die). From a perspective of developmental biology the ear is initially smooth. But numerous outgrowths (primordia) typically soon appear (in an acropetal direction) which become two lobed (spikelet pair primordium), each lobe finally giving rise to a spikelet (th…
database_cross_reference: maizedb:pldv (ID#165572)
has_obo_namespace: zea_mays_anatomy
has_related_synonym: pistillate inflorescence
id: ZEA:0015084

Axiom
annotated source: ear (functionally female inflorescence)
annotated property: definition
annotated target: The 'ear' is the distal part of a lateral (axillary) branch and bears the functionally-female florets in a highly contracted inflorescence. The upper one or two culm axillary buds (associated with the nodes of the culm (stalk)), located about midway on the culm, develop fully into short lateral branches, each terminating in a developing ear capable of producing mature kernels (caryopses). Each of the culm axillary buds is covered with about 8-14 modified leaves called husks, and a prophyll (the most basal modified leaf on the lateral branch). The ear branch (lateral branch, shank) consists of nodes and short internodes. The ear itself does not have lateral branches but its thick axis (called the cob), is similar to the central spike of the tassel in that it produces multiple longitudinal rows of paired spikelets (polystichous phyllotaxy). Each spikelet is ensheathed (enclosed) by a pair of glumes and contains only one functionally-female floret. Although two florets are initiated during spikelet ontogeny, only the upper floret develops; the lower floret aborts at an early stage of development. Both florets within a spikelet produce a lemma, but usually only the upper floret produces a palea. The palea of the lower floret either does not initiate or remains rudimentary. Each functionally-female floret produces an ovary with an elongated silk (style) covered with hairs (trichomes). Note that the culm axillary buds, which are not appropriately placed for full development, degenerate at an early stage. The amount of growth before degeneration/senescence occurs varies, as the buds may either die without much development or form ears several centimeters long, which resemble the functional ears until they senesce (die). From a perspective of developmental biology the ear is initially smooth. But numerous outgrowths (primordia) typically soon appear (in an acropetal direction) which become two lobed (spikelet pair primordium), each lobe finally giving rise to a spikelet (th…
database_cross_reference: MaizeGDB:59445
database_cross_reference: MaizeGDB:60893
database_cross_reference: MaizeGDB:lv (ID # 165572)

tassel (functionally male inflorescence)
type: Class
subclass of: organ
definition: The functionally-male flowering structure (staminate inflorescence) which terminates the culm (stem) of a Zea mays plant. The tassel is a branched inflorescence and consists of a central spike (rachis) and about 10-50 lateral branches. Many paired spikelets (pedicellate & sessile) arise from the central spike and lateral branches. The paired spikelets on the central spike occur in many ranks (longitudinal rows) around the central spike. The paired spikelets of the lateral branches are arranged in only two rows on the lower (adaxial) surface of each lateral branch. Each spikelet bears two male (staminate) florets, the upper and the lower floret. The development of the upper floret is about 2-3 days ahead of the lower floret (measured at anthesis). Each spikelet has a pair of leaf-like (bract-like) glumes, arising from the spikelet pedicel, which ensheath (encase) the two florets within. Within the glumes each floret is further enclosed by a pair of thin scale-like bracts - the lemma (located adjacent to the glume) and a palea (located opposite to the lemma and adjacent to the palea of the other floret in the spikelet). Within each floret, two of the three stamens are located adjacent to the margins of the palea; the third stamen is located adjacent to the midline of the lemma and is flanked by two lodicules. The two lodicules swell at the commencement of anthesis (period from floret opening to fertilization). This swelling forces apart the lemma and palea enclosing the floret, which facilitates the extrusion of the anthers via the elongation of the filaments. Following extrusion, the anthers dangle downward and shed pollen from an opening at the apex (tip) of each anther locule. The tassel exhibits an indeterminate growth pattern. Note that Zea mays is monoecious (separate male & female flowers/florets borne on the same plant). From a perspective of developmental biology the central axis and lateral branches of the tassel are at first smooth. But numerous outgrowths …
database_cross_reference: maizedb:pldv (ID#165572)
has_obo_namespace: zea_mays_anatomy
has_related_synonym: staminate inflorescence
id: ZEA:0015085

Axiom
annotated source: tassel (functionally male inflorescence)
annotated property: definition
annotated target: The functionally-male flowering structure (staminate inflorescence) which terminates the culm (stem) of a Zea mays plant. The tassel is a branched inflorescence and consists of a central spike (rachis) and about 10-50 lateral branches. Many paired spikelets (pedicellate & sessile) arise from the central spike and lateral branches. The paired spikelets on the central spike occur in many ranks (longitudinal rows) around the central spike. The paired spikelets of the lateral branches are arranged in only two rows on the lower (adaxial) surface of each lateral branch. Each spikelet bears two male (staminate) florets, the upper and the lower floret. The development of the upper floret is about 2-3 days ahead of the lower floret (measured at anthesis). Each spikelet has a pair of leaf-like (bract-like) glumes, arising from the spikelet pedicel, which ensheath (encase) the two florets within. Within the glumes each floret is further enclosed by a pair of thin scale-like bracts - the lemma (located adjacent to the glume) and a palea (located opposite to the lemma and adjacent to the palea of the other floret in the spikelet). Within each floret, two of the three stamens are located adjacent to the margins of the palea; the third stamen is located adjacent to the midline of the lemma and is flanked by two lodicules. The two lodicules swell at the commencement of anthesis (period from floret opening to fertilization). This swelling forces apart the lemma and palea enclosing the floret, which facilitates the extrusion of the anthers via the elongation of the filaments. Following extrusion, the anthers dangle downward and shed pollen from an opening at the apex (tip) of each anther locule. The tassel exhibits an indeterminate growth pattern. Note that Zea mays is monoecious (separate male & female flowers/florets borne on the same plant). From a perspective of developmental biology the central axis and lateral branches of the tassel are at first smooth. But numerous outgrowths …
database_cross_reference: MaizeGDB:59445
database_cross_reference: MaizeGDB:60893
database_cross_reference: MaizeGDB:lv (ID # 165572)

spikelet
type: Class
subclass of: organ
subclass of: Restriction
  on property: Part of
  some values from: ear (functionally female inflorescence)
subclass of: Restriction
  on property: Part of
  some values from: upper glume of sessile spikelet of tassel
definition: The spikelet is the basic unit of the grass inflorescence and each spikelet is usually subtended by a pair of leaf-like (bract-like) structures, called glumes, at its base. The two glumes are referred to as the lower glume and the upper glume. In Zea each spikelet of the tassel (staminate inflorescence) comprises two florets (flowers). Similarly each spikelet of the lateral branch (ear or pistillate inflorescence) contains initially two florets although one of these is usually arrested in its development very early on. Note that in both the staminate and pistillate inflorescences the spikelets occur in pairs (sessile & pedicellate spikelets), joined to a common pedicel.
has_obo_namespace: zea_mays_anatomy
id: ZEA:0015086

Axiom
annotated source: spikelet
annotated property: definition
annotated target: The spikelet is the basic unit of the grass inflorescence and each spikelet is usually subtended by a pair of leaf-like (bract-like) structures, called glumes, at its base. The two glumes are referred to as the lower glume and the upper glume. In Zea each spikelet of the tassel (staminate inflorescence) comprises two florets (flowers). Similarly each spikelet of the lateral branch (ear or pistillate inflorescence) contains initially two florets although one of these is usually arrested in its development very early on. Note that in both the staminate and pistillate inflorescences the spikelets occur in pairs (sessile & pedicellate spikelets), joined to a common pedicel.
database_cross_reference: MaizeGDB:lv (ID # 165572)

lemma
type: Class
subclass of: leaf
subclass of: Restriction
  on property: Part of
  some values from: floret
definition: The penultimate bract-like structure that subtends the grass floret. The lemma is oriented in a position that is opposite the palea in each floret. The lemma arises from the floret pedicel immediately below the palea. See elsewhere for further information on the lemma associated with each individual floret of the male and female spikelets. Lemmas are considered to be homologous to the vegetative leaf.
has_obo_namespace: zea_mays_anatomy
id: ZEA:0015087

Axiom
annotated source: lemma
annotated property: definition
annotated target: The penultimate bract-like structure that subtends the grass floret. The lemma is oriented in a position that is opposite the palea in each floret. The lemma arises from the floret pedicel immediately below the palea. See elsewhere for further information on the lemma associated with each individual floret of the male and female spikelets. Lemmas are considered to be homologous to the vegetative leaf.
database_cross_reference: MaizeGDB:lv (ID # 165572)

palea
type: Class
subclass of: Restriction
  on property: Part of
  some values from: floret
definition: The palea is the uppermost bract-like structure that subtends the grass floret. The palea is oriented in a position that is opposite the lemma which also subtends the floret and arises from the floret pedicel immediately below the palea. See elsewhere for further information on the palea associated with each individual floret of the male and female spikelets. The palea is a bikeeled structure and its relationship to the leaf (homology) is unknown.
database_cross_reference: maizedb:pldv (ID# 165572)
has_obo_namespace: zea_mays_anatomy
has_related_synonym: glumella
id: ZEA:0015088

Axiom
annotated source: palea
annotated property: definition
annotated target: The palea is the uppermost bract-like structure that subtends the grass floret. The palea is oriented in a position that is opposite the lemma which also subtends the floret and arises from the floret pedicel immediately below the palea. See elsewhere for further information on the palea associated with each individual floret of the male and female spikelets. The palea is a bikeeled structure and its relationship to the leaf (homology) is unknown.
database_cross_reference: MaizeGDB:lv (ID # 165572)

pedicellate spikelet of ear
type: Class
subclass of: Restriction
  on property: Part of
  some values from: ear (functionally female inflorescence)
has_obo_namespace: zea_mays_anatomy
id: ZEA:0015089

sessile spikelet of ear
type: Class
subclass of: Restriction
  on property: Part of
  some values from: ear (functionally female inflorescence)
has_obo_namespace: zea_mays_anatomy
id: ZEA:0015090

lemma of upper floret of pedicellate spikelet of ear
type: Class
subclass of: Restriction
  on property: Part of
  some values from: upper floret of pedicellate spikelet of ear
definition: The penultimate bract-like structure that subtends the upper (pedicelled) floret of the pedicellate spikelet of the ear (pistillate inflorescence). As part of the upper floret, the inner lemma is oriented in a position that is opposite the palea & adjacent to the upper (inner) glume of the pedicellate spikelet. The lemma arises from the floret pedicel immediately below the palea.
database_cross_reference: maizedb:pldv (ID# 165572)
has_obo_namespace: zea_mays_anatomy
has_related_synonym: inner lemma of ear
id: ZEA:0015091

Axiom
annotated source: lemma of upper floret of pedicellate spikelet of ear
annotated property: definition
annotated target: The penultimate bract-like structure that subtends the upper (pedicelled) floret of the pedicellate spikelet of the ear (pistillate inflorescence). As part of the upper floret, the inner lemma is oriented in a position that is opposite the palea & adjacent to the upper (inner) glume of the pedicellate spikelet. The lemma arises from the floret pedicel immediately below the palea.
database_cross_reference: MaizeGDB:lv (ID # 165572)

lemma of lower floret of pedicellate spikelet of ear
type: Class
subclass of: Restriction
  on property: Part of
  some values from: lower floret of pedicellate spikelet of ear
definition: The penultimate bract-like structure that subtends the lower (sessile) floret of the pedicellate spikelet of the ear (pistillate inflorescence). As part of the lower floret, the outer lemma is oriented in a position that is opposite the palea & adjacent to the lower (outer) glume of the pedicellate spikelet. The lemma arises from the floret pedicel immediately below the palea.
database_cross_reference: maizedb:pldv (ID# 165572)
has_obo_namespace: zea_mays_anatomy
has_related_synonym: outer lemma of ear
id: ZEA:0015092

Axiom
annotated source: lemma of lower floret of pedicellate spikelet of ear
annotated property: definition
annotated target: The penultimate bract-like structure that subtends the lower (sessile) floret of the pedicellate spikelet of the ear (pistillate inflorescence). As part of the lower floret, the outer lemma is oriented in a position that is opposite the palea & adjacent to the lower (outer) glume of the pedicellate spikelet. The lemma arises from the floret pedicel immediately below the palea.
database_cross_reference: MaizeGDB:lv (ID # 165572)

lemma of upper floret of sessile spikelet of ear
type: Class
subclass of: Restriction
  on property: Part of
  some values from: upper floret of sessile spikelet of ear
definition: The penultimate bract-like structure that subtends the upper (pedicelled) floret of the sessile spikelet of the ear (pistillate inflorescence). As part of the upper floret, the inner lemma is oriented in a position that is opposite the palea & adjacent to the upper (inner) glume of the sessile spikelet. The lemma arises from the floret pedicel immediately below the palea.
has_obo_namespace: zea_mays_anatomy
id: ZEA:0015093

Axiom
annotated source: lemma of upper floret of sessile spikelet of ear
annotated property: definition
annotated target: The penultimate bract-like structure that subtends the upper (pedicelled) floret of the sessile spikelet of the ear (pistillate inflorescence). As part of the upper floret, the inner lemma is oriented in a position that is opposite the palea & adjacent to the upper (inner) glume of the sessile spikelet. The lemma arises from the floret pedicel immediately below the palea.
database_cross_reference: MaizeGDB:lv (ID # 165572)

lemma of lower floret of sessile spikelet of ear
type: Class
subclass of: Restriction
  on property: Part of
  some values from: lower floret of sessile spikelet of ear
definition: The penultimate bract-like structure that subtends the lower (sessile) floret of the sessile spikelet of the ear (pistillate inflorescence). As part of the lower floret, the outer lemma is oriented in a position that is opposite the palea & adjacent to the lower (outer) glume of the sessile spikelet. The lemma arises from the floret pedicel immediately below the palea. (Vincent, ID#165572)
has_obo_namespace: zea_mays_anatomy
id: ZEA:0015094

Axiom
annotated source: lemma of lower floret of sessile spikelet of ear
annotated property: definition
annotated target: The penultimate bract-like structure that subtends the lower (sessile) floret of the sessile spikelet of the ear (pistillate inflorescence). As part of the lower floret, the outer lemma is oriented in a position that is opposite the palea & adjacent to the lower (outer) glume of the sessile spikelet. The lemma arises from the floret pedicel immediately below the palea. (Vincent, ID#165572)
database_cross_reference: MaizeGDB:lv (ID # 165572)

upper glume of pedicellate spikelet of ear
type: Class
subclass of: Restriction
  on property: Part of
  some values from: pedicellate spikelet of ear
definition: The upper (inner) of the two bract-like structures that subtend the base of the pedicelled spikelets of the ear (pistillate inflorescence). Note that each of the many paired spikelets of the ear (pistillate inflorescence) has an upper glume. Each spikelet is subtended by a pair of glumes (lower & upper glumes). (Vincent, ID#165572)
has_obo_namespace: zea_mays_anatomy
id: ZEA:0015095

Axiom
annotated source: upper glume of pedicellate spikelet of ear
annotated property: definition
annotated target: The upper (inner) of the two bract-like structures that subtend the base of the pedicelled spikelets of the ear (pistillate inflorescence). Note that each of the many paired spikelets of the ear (pistillate inflorescence) has an upper glume. Each spikelet is subtended by a pair of glumes (lower & upper glumes). (Vincent, ID#165572)
database_cross_reference: MaizeGDB:lv (ID # 165572)

lower glume of pedicellate spikelet of ear
type: Class
subclass of: Restriction
  on property: Part of
  some values from: pedicellate spikelet of ear
definition: The lower (outer) of the two bract-like structures that subtend the base of the pedicelled spikelets of the ear (pistillate inflorescence). Note that each of the many paired spikelets of the ear (pistillate inflorescence) has a lower glume. Each spikelet is subtended by a pair of glumes (lower & upper glumes). (Vincent, ID#165572)
has_obo_namespace: zea_mays_anatomy
id: ZEA:0015096

Axiom
annotated source: lower glume of pedicellate spikelet of ear
annotated property: definition
annotated target: The lower (outer) of the two bract-like structures that subtend the base of the pedicelled spikelets of the ear (pistillate inflorescence). Note that each of the many paired spikelets of the ear (pistillate inflorescence) has a lower glume. Each spikelet is subtended by a pair of glumes (lower & upper glumes). (Vincent, ID#165572)
database_cross_reference: MaizeGDB:lv (ID # 165572)

upper floret of pedicellate spikelet of ear
type: Class
subclass of: Restriction
  on property: Part of
  some values from: pedicellate spikelet of ear
has_obo_namespace: zea_mays_anatomy
id: ZEA:0015097

lower floret of pedicellate spikelet of ear
type: Class
subclass of: Restriction
  on property: Part of
  some values from: pedicellate spikelet of ear
has_obo_namespace: zea_mays_anatomy
id: ZEA:0015098

palea of upper floret of pedicellate spikelet of tassel
type: Class
subclass of: Restriction
  on property: Part of
  some values from: upper floret of pedicellate spikelet of ear
definition: The uppermost bract-like structure that subtends the upper (pedicellate) floret of the pedicellate spikelet of the tassel (staminate inflorescence). The palea is oriented in a position that is opposite the lemma which subtends the same floret. The palea arises from the floret pedicel immediately above the lemma.
has_obo_namespace: zea_mays_anatomy
id: ZEA:0015099

Axiom
annotated source: palea of upper floret of pedicellate spikelet of tassel
annotated property: definition
annotated target: The uppermost bract-like structure that subtends the upper (pedicellate) floret of the pedicellate spikelet of the tassel (staminate inflorescence). The palea is oriented in a position that is opposite the lemma which subtends the same floret. The palea arises from the floret pedicel immediately above the lemma.
database_cross_reference: MaizeGDB:lv (ID # 165572)

palea of lower floret of pedicellate spikelet of ear
type: Class
subclass of: Restriction
  on property: Part of
  some values from: lower floret of pedicellate spikelet of ear
definition: The uppermost bract-like structure that subtends the lower (sessile) floret of the pedicellate spikelet of the ear (pistillate inflorescence). This palea either does not initiate or remains rudimentary. The palea is oriented in a position that is opposite the lemma which subtends the same floret. The palea arises from the floret pedicel immediately above the lemma. (Vincent, ID#165572)
has_obo_namespace: zea_mays_anatomy
id: ZEA:0015100

Axiom
annotated source: palea of lower floret of pedicellate spikelet of ear
annotated property: definition
annotated target: The uppermost bract-like structure that subtends the lower (sessile) floret of the pedicellate spikelet of the ear (pistillate inflorescence). This palea either does not initiate or remains rudimentary. The palea is oriented in a position that is opposite the lemma which subtends the same floret. The palea arises from the floret pedicel immediately above the lemma. (Vincent, ID#165572)
database_cross_reference: MaizeGDB:lv (ID # 165572)

stylar ridge of upper floret of pedicellate spikelet of ear
type: Class
subclass of: Restriction
  on property: Part of
  some values from: upper floret of pedicellate spikelet of ear
definition: The gynoecium development of the upper floret begins with the production of a ridge on the abaxial surface of the apical meristem of the floret, distal to the third stamen (which later degenerates). This is the stylar ridge. Continued overgrowth of the shoot apex (which becomes the ovule primordium) by the ring of stylar tissue leads to the formation of the stylar canal, which is detected as a slight protruberance on the mature ovary. (Cheng & Pareddy, ID#60893,
has_obo_namespace: zea_mays_anatomy
id: ZEA:0015101

Axiom
annotated source: stylar ridge of upper floret of pedicellate spikelet of ear
annotated property: definition
annotated target: The gynoecium development of the upper floret begins with the production of a ridge on the abaxial surface of the apical meristem of the floret, distal to the third stamen (which later degenerates). This is the stylar ridge. Continued overgrowth of the shoot apex (which becomes the ovule primordium) by the ring of stylar tissue leads to the formation of the stylar canal, which is detected as a slight protruberance on the mature ovary. (Cheng & Pareddy, ID#60893,
database_cross_reference: MaizeGDB:60893
database_cross_reference: MaizeGDB:lv (ID # 165572)

stylar ridge (abortive) of lower floret of pedicellate spikelet of ear
type: Class
subclass of: Restriction
  on property: Part of
  some values from: lower floret of pedicellate spikelet of ear
definition: The gynoecium development of the lower floret begins with the production of a ridge on the abaxial surface of the apical meristem of the floret, distal to the third stamen (which later degenerates). This is the stylar ridge. While the development of this stylar ridge is very similar to that of the upper florets, the development does not proceed beyond the early ridge stage.
has_obo_namespace: zea_mays_anatomy
id: ZEA:0015102

Axiom
annotated source: stylar ridge (abortive) of lower floret of pedicellate spikelet of ear
annotated property: definition
annotated target: The gynoecium development of the lower floret begins with the production of a ridge on the abaxial surface of the apical meristem of the floret, distal to the third stamen (which later degenerates). This is the stylar ridge. While the development of this stylar ridge is very similar to that of the upper florets, the development does not proceed beyond the early ridge stage.
database_cross_reference: MaizeGDB:60893
database_cross_reference: MaizeGDB:lv (ID # 165572)

pedicellate spikelet of tassel
type: Class
subclass of: Restriction
  on property: Part of
  some values from: tassel (functionally male inflorescence)
has_obo_namespace: zea_mays_anatomy
id: ZEA:0015103

sessile spikelet of tassel
type: Class
subclass of: Restriction
  on property: Part of
  some values from: tassel (functionally male inflorescence)
has_obo_namespace: zea_mays_anatomy
id: ZEA:0015104

upper floret of pedicellate spikelet of tassel
type: Class
subclass of: Restriction
  on property: Part of
  some values from: pedicellate spikelet of tassel
has_obo_namespace: zea_mays_anatomy
id: ZEA:0015105

lower floret of pedicellate spikelet of tassel
type: Class
subclass of: Restriction
  on property: Part of
  some values from: pedicellate spikelet of tassel
has_obo_namespace: zea_mays_anatomy
id: ZEA:0015106

upper floret of sessile spikelet of tassel
type: Class
subclass of: Restriction
  on property: Part of
  some values from: sessile spikelet of tassel
has_obo_namespace: zea_mays_anatomy
id: ZEA:0015107

lower floret of sessile spikelet of tassel
type: Class
subclass of: Restriction
  on property: Part of
  some values from: sessile spikelet of tassel
has_obo_namespace: zea_mays_anatomy
id: ZEA:0015108

upper glume of pedicellate spikelet of tassel
type: Class
subclass of: Restriction
  on property: Part of
  some values from: pedicellate spikelet of tassel
definition: The upper (inner) of the two leaf-like (bract-like) structures that subtend the base of the pedicelled spikelets of the tassel (staminate inflorescence). Note that each of the many paired spikelets of the tassel (staminate inflorescence) has an upper glume. Each spikelet is subtended by a pair of glumes (lower & upper glumes).
has_obo_namespace: zea_mays_anatomy
id: ZEA:0015109

Axiom
annotated source: upper glume of pedicellate spikelet of tassel
annotated property: definition
annotated target: The upper (inner) of the two leaf-like (bract-like) structures that subtend the base of the pedicelled spikelets of the tassel (staminate inflorescence). Note that each of the many paired spikelets of the tassel (staminate inflorescence) has an upper glume. Each spikelet is subtended by a pair of glumes (lower & upper glumes).
database_cross_reference: MaizeGDB:lv (ID # 165572)

lower glume of pedicellate spikelet of tassel
type: Class
subclass of: Restriction
  on property: Part of
  some values from: pedicellate spikelet of tassel
definition: The lower (outer) of the two leaf-like (bract-like) structures that subtend the base of the pedicelled spikelets of the tassel (staminate inflorescence). Note that each of the many paired spikelets of the tassel (staminate inflorescence) has a lower glume. Each spikelet is subtended by a pair of glumes (lower & upper glumes).
has_obo_namespace: zea_mays_anatomy
id: ZEA:0015110

Axiom
annotated source: lower glume of pedicellate spikelet of tassel
annotated property: definition
annotated target: The lower (outer) of the two leaf-like (bract-like) structures that subtend the base of the pedicelled spikelets of the tassel (staminate inflorescence). Note that each of the many paired spikelets of the tassel (staminate inflorescence) has a lower glume. Each spikelet is subtended by a pair of glumes (lower & upper glumes).
database_cross_reference: MaizeGDB:lv (ID # 165572)

upper glume of sessile spikelet of tassel
type: Class
subclass of: Restriction
  on property: Part of
  some values from: sessile spikelet of tassel
definition: The upper (inner) of the two leaf-like (bract-like) structures that subtend the base of the sessile spikelets of the tassel (staminate inflorescence). Note that each of the many paired spikelets of the tassel (staminate inflorescence) has an upper glume. Each spikelet is subtended by a pair of glumes (lower & upper glumes).
has_obo_namespace: zea_mays_anatomy
id: ZEA:0015111

Axiom
annotated source: upper glume of sessile spikelet of tassel
annotated property: definition
annotated target: The upper (inner) of the two leaf-like (bract-like) structures that subtend the base of the sessile spikelets of the tassel (staminate inflorescence). Note that each of the many paired spikelets of the tassel (staminate inflorescence) has an upper glume. Each spikelet is subtended by a pair of glumes (lower & upper glumes).
database_cross_reference: MaizeGDB:lv (ID # 165572)

lower glume of sessile spikelet of tassel
type: Class
subclass of: Restriction
  on property: Part of
  some values from: sessile spikelet of tassel
definition: The lower (outer) of the two leaf-like (bract-like) structures that subtend the base of the sessile spikelets of the tassel (staminate inflorescence). Note that each of the many paired spikelets of the tassel (staminate inflorescence) has a lower glume. Each spikelet is subtended by a pair of glumes (lower & upper glumes).
has_obo_namespace: zea_mays_anatomy
id: ZEA:0015112

Axiom
annotated source: lower glume of sessile spikelet of tassel
annotated property: definition
annotated target: The lower (outer) of the two leaf-like (bract-like) structures that subtend the base of the sessile spikelets of the tassel (staminate inflorescence). Note that each of the many paired spikelets of the tassel (staminate inflorescence) has a lower glume. Each spikelet is subtended by a pair of glumes (lower & upper glumes).
database_cross_reference: MaizeGDB:lv (ID # 165572)

palea of upper floret of pedicellate spikelet of tassel
type: Class
subclass of: Restriction
  on property: Part of
  some values from: upper floret of pedicellate spikelet of tassel
definition: The uppermost bract-like structure that subtends the upper (pedicellate) floret of the pedicellate spikelet of the tassel (staminate inflorescence). The palea is oriented in a position that is opposite the lemma which subtends the same floret. The palea arises from the floret pedicel immediately above the lemma.
has_obo_namespace: zea_mays_anatomy
id: ZEA:0015113

Axiom
annotated source: palea of upper floret of pedicellate spikelet of tassel
annotated property: definition
annotated target: The uppermost bract-like structure that subtends the upper (pedicellate) floret of the pedicellate spikelet of the tassel (staminate inflorescence). The palea is oriented in a position that is opposite the lemma which subtends the same floret. The palea arises from the floret pedicel immediately above the lemma.
database_cross_reference: MaizeGDB:lv (ID # 165572)

palea of lower floret of pedicellate spikelet of tassel
type: Class
subclass of: Restriction
  on property: Part of
  some values from: lower floret of pedicellate spikelet of tassel
definition: The uppermost bract-like structure that subtends the lower (sessile) floret of the pedicellate spikelet of the tassel (staminate inflorescence). The palea is oriented in a position that is opposite the lemma which subtends the same floret. The palea arises from the floret pedicel immediately above the lemma.
has_obo_namespace: zea_mays_anatomy
id: ZEA:0015114

Axiom
annotated source: palea of lower floret of pedicellate spikelet of tassel
annotated property: definition
annotated target: The uppermost bract-like structure that subtends the lower (sessile) floret of the pedicellate spikelet of the tassel (staminate inflorescence). The palea is oriented in a position that is opposite the lemma which subtends the same floret. The palea arises from the floret pedicel immediately above the lemma.
database_cross_reference: MaizeGDB:lv (ID # 165572)

palea of upper floret of sessile spikelet of tassel
type: Class
subclass of: Restriction
  on property: Part of
  some values from: upper floret of sessile spikelet of tassel
definition: The uppermost bract-like structure that subtends the upper (pedicellate) floret of the sessile spikelet of the tassel (staminate inflorescence). The palea is oriented in a position that is opposite the lemma which subtends the same floret. The palea arises from the floret pedicel immediately above the lemma.
has_obo_namespace: zea_mays_anatomy
id: ZEA:0015115

Axiom
annotated source: palea of upper floret of sessile spikelet of tassel
annotated property: definition
annotated target: The uppermost bract-like structure that subtends the upper (pedicellate) floret of the sessile spikelet of the tassel (staminate inflorescence). The palea is oriented in a position that is opposite the lemma which subtends the same floret. The palea arises from the floret pedicel immediately above the lemma.
database_cross_reference: MaizeGDB:lv (ID # 165572)

palea of lower floret of sessile spikelet of tassel
type: Class
subclass of: Restriction
  on property: Part of
  some values from: lower floret of sessile spikelet of tassel
definition: The uppermost bract-like structure that subtends the lower (sessile) floret of the sessile spikelet of the tassel (staminate inflorescence). The palea is oriented in a position that is opposite the lemma which subtends the same floret. The palea arises from the floret pedicel immediately above the lemma.
has_obo_namespace: zea_mays_anatomy
id: ZEA:0015116

Axiom
annotated source: palea of lower floret of sessile spikelet of tassel
annotated property: definition
annotated target: The uppermost bract-like structure that subtends the lower (sessile) floret of the sessile spikelet of the tassel (staminate inflorescence). The palea is oriented in a position that is opposite the lemma which subtends the same floret. The palea arises from the floret pedicel immediately above the lemma.
database_cross_reference: MaizeGDB:lv (ID # 165572)

stamens of lower floret of sessile spikelet of tassel
type: Class
subclass of: Restriction
  on property: Part of
  some values from: lower floret of sessile spikelet of tassel
definition: The stamens comprise the androecium of each tassel floret (flower). Each of the three stamens comprises of a stalk-like filament which terminates in the pollen-producing anther.
has_obo_namespace: zea_mays_anatomy
id: ZEA:0015117

Axiom
annotated source: stamens of lower floret of sessile spikelet of tassel
annotated property: definition
annotated target: The stamens comprise the androecium of each tassel floret (flower). Each of the three stamens comprises of a stalk-like filament which terminates in the pollen-producing anther.
database_cross_reference: MaizeGDB:lv (ID# 165572)

gynoecial tissue (abortive) of lower floret of pedicellate spikelet of tassel
type: Class
subclass of: Restriction
  on property: Part of
  some values from: lower floret of pedicellate spikelet of tassel
definition: The development of the gynoecial tissue from the floral meristem occurs during the ongoing development of the three stamen primordia.The gynoecial tissue develops via the initiation of an adaxial ridge on the remainder of the floral meristem distal to the three stamens. Soon after initiation the gynoecial tissue begins to abort and subsequently degenerates. This abortion and degeneration of this tissue in the lower floret of the pedicellate spikelet occurs before the same process occurs in the upper floret.
has_obo_namespace: zea_mays_anatomy
id: ZEA:0015118

Axiom
annotated source: gynoecial tissue (abortive) of lower floret of pedicellate spikelet of tassel
annotated property: definition
annotated target: The development of the gynoecial tissue from the floral meristem occurs during the ongoing development of the three stamen primordia.The gynoecial tissue develops via the initiation of an adaxial ridge on the remainder of the floral meristem distal to the three stamens. Soon after initiation the gynoecial tissue begins to abort and subsequently degenerates. This abortion and degeneration of this tissue in the lower floret of the pedicellate spikelet occurs before the same process occurs in the upper floret.
database_cross_reference: MaizeGDB:60893
database_cross_reference: MaizeGDB:lv (ID # 165572)

lodicules of upper floret of pedicellate spikelet of tassel
type: Class
subclass of: Restriction
  on property: Part of
  some values from: upper floret of pedicellate spikelet of tassel
definition: Two, small, scale-like. pale-green structures (glandular-like organs) found adjacent to the inner surface of the base of the lemma of the floret. The adjacent margins of the two lodicules (opposite the mid-line of the lemma) are adpressed to each other while the inner surfaces of the lodicules form an angle of approximately 80 degrees to each other. Within the triangle of basal tissue, bounded on two sides by the two lodicules, are located the three filaments of the stamens. Just prior to anthesis the lodicules grow/swell laterally and the triangle of space between the lodicules is almost obscured. The two lodicules are thought to be involved in opening of the grass floret (flower) in readiness for pollination (at anthesis they grow/become increasingly turgid and are presumed to contribute to the displacing of the adjacent lemma and glume which facilitates the exsertion of the anthers for wind pollination). Gibbs Russell et al., Grasses of southern Africa, 1990; Ambrose et al., (2000), Molecular and Genetic Analyses of the Silky1 Gene Reveal Conservation in Floral Organ Specification between Eudicots and Monocots, Molecular Cell 5:569-579. Leszek Vincent 06/2000.
has_obo_namespace: zea_mays_anatomy
id: ZEA:0015119

Axiom
annotated source: lodicules of upper floret of pedicellate spikelet of tassel
annotated property: definition
annotated target: Two, small, scale-like. pale-green structures (glandular-like organs) found adjacent to the inner surface of the base of the lemma of the floret. The adjacent margins of the two lodicules (opposite the mid-line of the lemma) are adpressed to each other while the inner surfaces of the lodicules form an angle of approximately 80 degrees to each other. Within the triangle of basal tissue, bounded on two sides by the two lodicules, are located the three filaments of the stamens. Just prior to anthesis the lodicules grow/swell laterally and the triangle of space between the lodicules is almost obscured. The two lodicules are thought to be involved in opening of the grass floret (flower) in readiness for pollination (at anthesis they grow/become increasingly turgid and are presumed to contribute to the displacing of the adjacent lemma and glume which facilitates the exsertion of the anthers for wind pollination). Gibbs Russell et al., Grasses of southern Africa, 1990; Ambrose et al., (2000), Molecular and Genetic Analyses of the Silky1 Gene Reveal Conservation in Floral Organ Specification between Eudicots and Monocots, Molecular Cell 5:569-579. Leszek Vincent 06/2000.
database_cross_reference: MaizeGDB:lv (ID# 165572)

lodicules of lower floret of pedicellate spikelet of tassel
type: Class
subclass of: Restriction
  on property: Part of
  some values from: lower floret of pedicellate spikelet of tassel
definition: Two, small, scale-like. pale-green structures (glandular-like organs) found adjacent to the inner surface of the base of the lemma of the floret. The adjacent margins of the two lodicules (opposite the mid-line of the lemma) are adpressed to each other while the inner surfaces of the lodicules form an angle of approximately 80 degrees to each other. Within the triangle of basal tissue, bounded on two sides by the two lodicules, are located the three filaments of the stamens. Just prior to anthesis the lodicules grow/swell laterally and the triangle of space between the lodicules is almost obscured. The two lodicules are thought to be involved in opening of the grass floret (flower) in readiness for pollination (at anthesis they grow/become increasingly turgid and are presumed to contribute to the displacing of the adjacent lemma and glume which facilitates the exsertion of the anthers for wind pollination). Gibbs Russell et al., Grasses of southern Africa, 1990; Ambrose et al., (2000), Molecular and Genetic Analyses of the Silky1 Gene Reveal Conservation in Floral Organ Specification between Eudicots and Monocots, Molecular Cell 5:569-579. Leszek Vincent 06/2000.
has_obo_namespace: zea_mays_anatomy
id: ZEA:0015120

Axiom
annotated source: lodicules of lower floret of pedicellate spikelet of tassel
annotated property: definition
annotated target: Two, small, scale-like. pale-green structures (glandular-like organs) found adjacent to the inner surface of the base of the lemma of the floret. The adjacent margins of the two lodicules (opposite the mid-line of the lemma) are adpressed to each other while the inner surfaces of the lodicules form an angle of approximately 80 degrees to each other. Within the triangle of basal tissue, bounded on two sides by the two lodicules, are located the three filaments of the stamens. Just prior to anthesis the lodicules grow/swell laterally and the triangle of space between the lodicules is almost obscured. The two lodicules are thought to be involved in opening of the grass floret (flower) in readiness for pollination (at anthesis they grow/become increasingly turgid and are presumed to contribute to the displacing of the adjacent lemma and glume which facilitates the exsertion of the anthers for wind pollination). Gibbs Russell et al., Grasses of southern Africa, 1990; Ambrose et al., (2000), Molecular and Genetic Analyses of the Silky1 Gene Reveal Conservation in Floral Organ Specification between Eudicots and Monocots, Molecular Cell 5:569-579. Leszek Vincent 06/2000.
database_cross_reference: MaizeGDB:lv (ID# 165572)

stamens of upper floret of pedicellate spikelet of tassel
type: Class
subclass of: Restriction
  on property: Part of
  some values from: upper floret of pedicellate spikelet of tassel
definition: The stamens comprise the androecium of each tassel floret (flower). Each of the three stamens comprises of a stalk-like filament which terminates in the pollen-producing anther.
has_obo_namespace: zea_mays_anatomy
id: ZEA:0015121

Axiom
annotated source: stamens of upper floret of pedicellate spikelet of tassel
annotated property: definition
annotated target: The stamens comprise the androecium of each tassel floret (flower). Each of the three stamens comprises of a stalk-like filament which terminates in the pollen-producing anther.
database_cross_reference: MaizeGDB:lv (ID# 165572)

stamens of lower floret of pedicellate spikelet of tassel
type: Class
subclass of: Restriction
  on property: Part of
  some values from: lower floret of pedicellate spikelet of tassel
definition: The stamens comprise the androecium of each tassel floret (flower). Each of the three stamens comprises of a stalk-like filament which terminates in the pollen-producing anther.
has_obo_namespace: zea_mays_anatomy
id: ZEA:0015122

Axiom
annotated source: stamens of lower floret of pedicellate spikelet of tassel
annotated property: definition
annotated target: The stamens comprise the androecium of each tassel floret (flower). Each of the three stamens comprises of a stalk-like filament which terminates in the pollen-producing anther.
database_cross_reference: MaizeGDB:lv (ID# 165572)

stamens of upper floret of sessile spikelet of tassel
type: Class
subclass of: Restriction
  on property: Part of
  some values from: upper floret of sessile spikelet of tassel
definition: The stamens comprise the androecium of each tassel floret (flower). Each of the three stamens comprises of a stalk-like filament which terminates in the pollen-producing anther.
has_obo_namespace: zea_mays_anatomy
id: ZEA:0015123

Axiom
annotated source: stamens of upper floret of sessile spikelet of tassel
annotated property: definition
annotated target: The stamens comprise the androecium of each tassel floret (flower). Each of the three stamens comprises of a stalk-like filament which terminates in the pollen-producing anther.
database_cross_reference: MaizeGDB:lv (ID#165572)

stamens (abortive) of upper floret of pedicellate spikelet of ear
type: Class
subclass of: Restriction
  on property: Part of
  some values from: upper floret of pedicellate spikelet of ear
has_obo_namespace: zea_mays_anatomy
id: ZEA:0015124

stamens (abortive) of lower floret of pedicellate spikelet of ear
type: Class
subclass of: Restriction
  on property: Part of
  some values from: lower floret of pedicellate spikelet of ear
has_obo_namespace: zea_mays_anatomy
id: ZEA:0015125

upper floret of sessile spikelet of ear
type: Class
subclass of: Restriction
  on property: Part of
  some values from: sessile spikelet of ear
has_obo_namespace: zea_mays_anatomy
id: ZEA:0015126

lower floret of sessile spikelet of ear
type: Class
subclass of: Restriction
  on property: Part of
  some values from: sessile spikelet of ear
has_obo_namespace: zea_mays_anatomy
id: ZEA:0015127

lower glume
type: Class
subclass of: glume
definition: Each spikelet in either of the inflorescences in Zea is subtended by a pair of leaf-like (bract-like) structures, called glumes, at its base. The two glumes are referred to as the lower glume and the upper glume. The spikelet is the basic unit of the grass inflorescence. In Zea each spikelet of the tassel (staminate inflorescence) comprises two florets (flowers). Similarly each spikelet of the lateral branch (ear or pistillate inflorescence) contains initially two florets although one of these is usually arrested in its development very early on. Note that in both the staminate and pistillate inflorescences the spikelets occur in pairs (sessile & pedicellate spikelets), joined to a common pedicel.
has_obo_namespace: zea_mays_anatomy
id: ZEA:0015128

Axiom
annotated source: lower glume
annotated property: definition
annotated target: Each spikelet in either of the inflorescences in Zea is subtended by a pair of leaf-like (bract-like) structures, called glumes, at its base. The two glumes are referred to as the lower glume and the upper glume. The spikelet is the basic unit of the grass inflorescence. In Zea each spikelet of the tassel (staminate inflorescence) comprises two florets (flowers). Similarly each spikelet of the lateral branch (ear or pistillate inflorescence) contains initially two florets although one of these is usually arrested in its development very early on. Note that in both the staminate and pistillate inflorescences the spikelets occur in pairs (sessile & pedicellate spikelets), joined to a common pedicel.
database_cross_reference: MaizeGDB:lv (ID # 165572)

upper glume
type: Class
subclass of: glume
definition: Each spikelet in either of the inflorescences in Zea is subtended by a pair of leaf-like (bract-like) structures, called glumes, at its base. The two glumes are referred to as the lower glume and the upper glume. The spikelet is the basic unit of the grass inflorescence. In Zea each spikelet of the tassel (staminate inflorescence) comprises two florets (flowers). Similarly each spikelet of the lateral branch (ear or pistillate inflorescence) contains initially two florets although one of these is usually arrested in its development very early on. Note that in both the staminate and pistillate inflorescences the spikelets occur in pairs (sessile & pedicellate spikelets), joined to a common pedicel.
has_obo_namespace: zea_mays_anatomy
id: ZEA:0015129

Axiom
annotated source: upper glume
annotated property: definition
annotated target: Each spikelet in either of the inflorescences in Zea is subtended by a pair of leaf-like (bract-like) structures, called glumes, at its base. The two glumes are referred to as the lower glume and the upper glume. The spikelet is the basic unit of the grass inflorescence. In Zea each spikelet of the tassel (staminate inflorescence) comprises two florets (flowers). Similarly each spikelet of the lateral branch (ear or pistillate inflorescence) contains initially two florets although one of these is usually arrested in its development very early on. Note that in both the staminate and pistillate inflorescences the spikelets occur in pairs (sessile & pedicellate spikelets), joined to a common pedicel.
database_cross_reference: MaizeGDB:lv (ID # 165572)

glume
type: Class
subclass of: leaf
subclass of: Restriction
  on property: Part of
  some values from: spikelet
definition: Each spikelet in either of the inflorescences in Zea is subtended by a pair of leaf-like (bract-like) structures, called glumes, at its base. The two glumes are referred to as the lower glume and the upper glume. The spikelet is the basic unit of the grass inflorescence. In Zea each spikelet of the tassel (staminate inflorescence) comprises two florets (flowers). Similarly each spikelet of the lateral branch (ear or pistillate inflorescence) contains initially two florets although one of these is usually arrested in its development very early on. Note that in both the staminate and pistillate inflorescences the spikelets occur in pairs (sessile & pedicellate spikelets), joined to a common pedicel. Glumes are considered to be homologous to the vegetative leaf.
has_obo_namespace: zea_mays_anatomy
id: ZEA:0015130

Axiom
annotated source: glume
annotated property: definition
annotated target: Each spikelet in either of the inflorescences in Zea is subtended by a pair of leaf-like (bract-like) structures, called glumes, at its base. The two glumes are referred to as the lower glume and the upper glume. The spikelet is the basic unit of the grass inflorescence. In Zea each spikelet of the tassel (staminate inflorescence) comprises two florets (flowers). Similarly each spikelet of the lateral branch (ear or pistillate inflorescence) contains initially two florets although one of these is usually arrested in its development very early on. Note that in both the staminate and pistillate inflorescences the spikelets occur in pairs (sessile & pedicellate spikelets), joined to a common pedicel. Glumes are considered to be homologous to the vegetative leaf.
database_cross_reference: MaizeGDB:Freeling & Lane (ID# 60922)
database_cross_reference: MaizeGDB:lv (ID # 165572)

floret
type: Class
subclass of: Restriction
  on property: Part of
  some values from: spikelet
definition: The floret is the individual flower of the Zea mays plant. In the grass family (Poaceae, alt. Gramineae) each floret is typically bisexual (perfect), possessing both an androecium and a gynoecium. Each floret typically has a pair of bracts, the lemma and palea, which subtend the floret. It is important to note that In Zea mays the florets of the 'tassel' are functionally male (the female component (gynoecium) having aborted early on in development). The florets of the 'ear' are functionally female (the male components (androecium) having aborted early on in development). The possession of functionally male and functionally female florets (or flowers) on the same plant is a condition called monoecy. While Zea mays is functionally monoecious, the presence of both androecial and gynoecial tissue in the early stages of floret ontogeny is phylogenetically significant. Consequently, the androecium is represented in the florets of the ear and the gynoecium is represented in the florets of the tassel, even though either of these whorls is absent in the functional florets. The inclusion of both whorls in the floret ontology for the florets of ears and spikelets is based on this phylogenetically significant ontogeny. East and Hayes (1911, p. 134-135) provided the following: "Perhaps it should be mentioned in passing that the immature sex organs, so called, of maize seem endowed with the power of becoming either stamens or carpels. One often finds a normal ear ending in stamens, and nearly every plant produces lateral branches which have carpels and stamens mixed together indiscriminantly." Studies of mutants have explored these occurrences and similar occurrences in tassels, corroborating the inherent bisexual nature of the floret meristem prior to the subsequent development of the monoecious condition.
has_obo_namespace: zea_mays_anatomy
has_related_synonym: flower
id: ZEA:0015131

Axiom
annotated source: floret
annotated property: definition
annotated target: The floret is the individual flower of the Zea mays plant. In the grass family (Poaceae, alt. Gramineae) each floret is typically bisexual (perfect), possessing both an androecium and a gynoecium. Each floret typically has a pair of bracts, the lemma and palea, which subtend the floret. It is important to note that In Zea mays the florets of the 'tassel' are functionally male (the female component (gynoecium) having aborted early on in development). The florets of the 'ear' are functionally female (the male components (androecium) having aborted early on in development). The possession of functionally male and functionally female florets (or flowers) on the same plant is a condition called monoecy. While Zea mays is functionally monoecious, the presence of both androecial and gynoecial tissue in the early stages of floret ontogeny is phylogenetically significant. Consequently, the androecium is represented in the florets of the ear and the gynoecium is represented in the florets of the tassel, even though either of these whorls is absent in the functional florets. The inclusion of both whorls in the floret ontology for the florets of ears and spikelets is based on this phylogenetically significant ontogeny. East and Hayes (1911, p. 134-135) provided the following: "Perhaps it should be mentioned in passing that the immature sex organs, so called, of maize seem endowed with the power of becoming either stamens or carpels. One often finds a normal ear ending in stamens, and nearly every plant produces lateral branches which have carpels and stamens mixed together indiscriminantly." Studies of mutants have explored these occurrences and similar occurrences in tassels, corroborating the inherent bisexual nature of the floret meristem prior to the subsequent development of the monoecious condition.
database_cross_reference: MaizeGDB:East & Hayes (ID# 13237)
database_cross_reference: MaizeGDB:lv (ID # 165572)

rachilla
type: Class
subclass of: Restriction
  on property: Part of
  some values from: spikelet
definition: The rachilla, or central axis, is the structure which bears the distichous glumes at the base and florets above. While the rachilla is recognizable in the spikelets of the 'tassel' in Zea mays, the rachilla of the 'ear' spikelets is much reduced. The bases of the rachillas of the ear can be considered to have anastomosed, forming the collective structure that is referred to as the cob.
database_cross_reference: maizedb:pldv (ID#165572)
has_obo_namespace: zea_mays_anatomy
has_related_synonym: central axis
id: ZEA:0015132

Axiom
annotated source: rachilla
annotated property: definition
annotated target: The rachilla, or central axis, is the structure which bears the distichous glumes at the base and florets above. While the rachilla is recognizable in the spikelets of the 'tassel' in Zea mays, the rachilla of the 'ear' spikelets is much reduced. The bases of the rachillas of the ear can be considered to have anastomosed, forming the collective structure that is referred to as the cob.
database_cross_reference: MaizeGDB:lv (ID # 165572)

silk
type: Class
subclass of: Restriction
  on property: Part of
  some values from: gynoecium
definition: The hair-like styles in maize. Each silk arises from the distal end (silk scar region) of each of the two anterior functional carpels. A vascular strand passes up through each anterior carpel into the attached silk and extends to the branched tip of the silk where it divides and extends down the length of each branch. The surface of the silk becomes covered with numerous hairs (trichomes) which arise from the epidermal cells. The hairs are most numerous along the edges of the silk. Each hair (trichome) is composed of four rows of cells, so arranged that the intercelllular spaces between the rows form a continuous opening through the center of the hair. At the base of the silk is a growth zone (intercalary growth) where new cells develop causing continuous elongation of the silk until it is pollinated and fertilization occurs. At this time the zone of elongation shrivels up, forming the place where the silk later breaks loose. The silk is perhaps best considered as consisting of a very short style without hairs, above which is the region of intercalary growth. The branched part of the silk corresponds to the stigma of other grasses. The region formed by the intercalary growth zone is an addition to the stigma and has nothing homologous to it in most grasses.
database_cross_reference: maizedb:pldv (ID#165572)
has_obo_namespace: zea_mays_anatomy
has_related_synonym: style
id: ZEA:0015133

Axiom
annotated source: silk
annotated property: definition
annotated target: The hair-like styles in maize. Each silk arises from the distal end (silk scar region) of each of the two anterior functional carpels. A vascular strand passes up through each anterior carpel into the attached silk and extends to the branched tip of the silk where it divides and extends down the length of each branch. The surface of the silk becomes covered with numerous hairs (trichomes) which arise from the epidermal cells. The hairs are most numerous along the edges of the silk. Each hair (trichome) is composed of four rows of cells, so arranged that the intercelllular spaces between the rows form a continuous opening through the center of the hair. At the base of the silk is a growth zone (intercalary growth) where new cells develop causing continuous elongation of the silk until it is pollinated and fertilization occurs. At this time the zone of elongation shrivels up, forming the place where the silk later breaks loose. The silk is perhaps best considered as consisting of a very short style without hairs, above which is the region of intercalary growth. The branched part of the silk corresponds to the stigma of other grasses. The region formed by the intercalary growth zone is an addition to the stigma and has nothing homologous to it in most grasses.
database_cross_reference: MaizeGDB:kiesselbach (ID # 59445)
database_cross_reference: MaizeGDB:lv (ID # 165572)

stamen
type: Class
subclass of: Restriction
  on property: Part of
  some values from: androecium
definition: The male reproductive organ of a flowering plant, comprising the filament (stalk-like structure) and anther (pollen producing structure). The stemens of the floret (flower) are known collectively as the androecium (M. Allaby. 1992. The Concise Oxford Dictionary of Botany, The Oxford University Press.) A Wiedemeier 5/2000; Esau, K.; Anatomy of Seed Plants 1977. Leszek Vincent 05/2000
has_obo_namespace: zea_mays_anatomy
id: ZEA:0015134

Axiom
annotated source: stamen
annotated property: definition
annotated target: The male reproductive organ of a flowering plant, comprising the filament (stalk-like structure) and anther (pollen producing structure). The stemens of the floret (flower) are known collectively as the androecium (M. Allaby. 1992. The Concise Oxford Dictionary of Botany, The Oxford University Press.) A Wiedemeier 5/2000; Esau, K.; Anatomy of Seed Plants 1977. Leszek Vincent 05/2000
database_cross_reference: MaizeGDB:lv (ID # 165572)

anther
type: Class
subclass of: Restriction
  on property: Part of
  some values from: stamen
definition: The pollen bearing part of the stamen. In flowering plants, the tip of the stamen, which contains the pollen sacs and in which the pollen grains are formed; usually elevated by means of a filament.
has_obo_namespace: zea_mays_anatomy
id: ZEA:0015135

Axiom
annotated source: anther
annotated property: definition
annotated target: The pollen bearing part of the stamen. In flowering plants, the tip of the stamen, which contains the pollen sacs and in which the pollen grains are formed; usually elevated by means of a filament.
database_cross_reference: MaizeGDB:esau (ID # 139825)
database_cross_reference: MaizeGDB:lv (ID # 165572) - http //www.harcourt.com/dictionary/def/6/2/2/0/622000.html

filament
type: Class
subclass of: Restriction
  on property: Part of
  some values from: stamen
definition: The stalk-like structure of the stamen, which bears the anther. (M.Allaby. 1992. The Concise Oxford Dictionary of Botany, The Oxford University Press.).
has_obo_namespace: zea_mays_anatomy
id: ZEA:0015136

Axiom
annotated source: filament
annotated property: definition
annotated target: The stalk-like structure of the stamen, which bears the anther. (M.Allaby. 1992. The Concise Oxford Dictionary of Botany, The Oxford University Press.).
database_cross_reference: MaizeGDB:lv (ID # 165572)

lodicule
type: Class
subclass of: Restriction
  on property: Part of
  some values from: floret
definition: A small rounded or scale-like structure (glandular-like organ) found between the base of the stamens in the grass floret (flower). The lodicules (usually 2) each arise adjacent to the base of the ovary and are between the stamens adjacent to the lemma of the grass floret. Note that the anterior lodicule (the third lodicule), adjacent to the palea, is suppressed in most grass species. This suppression results in the trimerous arrangement of the lodicules together with the stamens and carpels being overlooked. The lodicules are thought to be involved in opening of the grass flower in readiness for pollination (they become turgid at anthesis, thus opening (pushing apart) the lemma and palea and facilitating wind pollination).
database_cross_reference: maizedb:pldv (ID#165572
has_obo_namespace: zea_mays_anatomy
has_related_synonym: glumella
id: ZEA:0015137

Axiom
annotated source: lodicule
annotated property: definition
annotated target: A small rounded or scale-like structure (glandular-like organ) found between the base of the stamens in the grass floret (flower). The lodicules (usually 2) each arise adjacent to the base of the ovary and are between the stamens adjacent to the lemma of the grass floret. Note that the anterior lodicule (the third lodicule), adjacent to the palea, is suppressed in most grass species. This suppression results in the trimerous arrangement of the lodicules together with the stamens and carpels being overlooked. The lodicules are thought to be involved in opening of the grass flower in readiness for pollination (they become turgid at anthesis, thus opening (pushing apart) the lemma and palea and facilitating wind pollination).
database_cross_reference: :Ambrose et al. , (2000). Molecular and Genetic Analysis of the Silky1 Gene Reveal Conservation in Floral Organ Specification between Eudicots and Monocots , Molecular Cell 5 569-579
database_cross_reference: :Gibbs Russel et al. , (1990). Grasses of southern Africa
database_cross_reference: MaizeGDB:lv (ID # 165572)

androecium
type: Class
subclass of: Restriction
  on property: Part of
  some values from: floret
definition: The androecium is the male reproductive whorl of a flowering plant, comprising the stamen(s). Each stamen of the androecium usually comprises of a filament (stalk-like structure) and anther (pollen producing structure). In some taxa one or more of the stamens may be sterile (producing no pollen). These modified stamens are called staminodes.
has_obo_namespace: zea_mays_anatomy
id: ZEA:0015138

Axiom
annotated source: androecium
annotated property: definition
annotated target: The androecium is the male reproductive whorl of a flowering plant, comprising the stamen(s). Each stamen of the androecium usually comprises of a filament (stalk-like structure) and anther (pollen producing structure). In some taxa one or more of the stamens may be sterile (producing no pollen). These modified stamens are called staminodes.
database_cross_reference: Allaby 1992:The Concise Oxford Dictionary of Botany
database_cross_reference: Esau 1977:Anatomy of Seed Plants
database_cross_reference: MaizeGDB:275295
database_cross_reference: MaizeGDB:lv (ID # 165572)
database_cross_reference: MaizeGDB:wiedemeier (ID # 292238)

gynoecium
type: Class
subclass of: Restriction
  on property: Part of
  some values from: floret
definition: Gynoecium is the collective term for all of the carpels or pistils of a flower (floret). Each carpel or pistil comprises of a stigma, style and ovary. In Zea the silk comprises the stigma and extended style.
database_cross_reference: maizedb:pldv (ID# 165572)
has_obo_namespace: zea_mays_anatomy
has_related_synonym: pistil
id: ZEA:0015139

Axiom
annotated source: gynoecium
annotated property: definition
annotated target: Gynoecium is the collective term for all of the carpels or pistils of a flower (floret). Each carpel or pistil comprises of a stigma, style and ovary. In Zea the silk comprises the stigma and extended style.
database_cross_reference: MaizeGDB:lv (ID # 165572)

husk sheath
type: Class
subclass of: Restriction
  on property: Part of
  some values from: husk
definition: The husk structure consists mostly of the husk sheath. The husk sheath is the proximal (basal) portion of the husk that initiates at each of the nodes of the lateral branch (shank). The husk sheathes are much broader and thinner than the sheathes of adult and juvenile leaves. The broadness of the husk sheathes enable them to cover much of the circumference of the developing ear. The distal end of the husk sheath ends with the husk ligule region which is terminated with a diminutive (short) or extended husk leaf (flag leaf). The outer husks (lowermost/most proximal) on the lateral branch (shank) are distichous (in two vertical ranks or rows on opposite sides of an axis) like the adult & juvenile leaves. While the inner (upper) husks are polystichous (arranged in several rows). Note that the term husk (instead of husk sheath) is colloquially used for the modified leaf tissue which surrounds the ear and the term is seldom associated with husk ligule and husk leaf (flag leaf). However, botanically, the term husk should be used for the entire structure (fide Kiesselbach, 1949), comprising the husk sheath, husk ligule and husk leaf (the latter components frequently being very diminutive). The perspective that husks are somewhat homologous with the adult and juvenile leaves justifies the usage of the term husk sheath for the predominant portion of the husk which surrounds the ear.
database_cross_reference: maizedb:pldv (ID # 165572)
has_obo_namespace: zea_mays_anatomy
has_related_synonym: husk
id: ZEA:0015140

Axiom
annotated source: husk sheath
annotated property: definition
annotated target: The husk structure consists mostly of the husk sheath. The husk sheath is the proximal (basal) portion of the husk that initiates at each of the nodes of the lateral branch (shank). The husk sheathes are much broader and thinner than the sheathes of adult and juvenile leaves. The broadness of the husk sheathes enable them to cover much of the circumference of the developing ear. The distal end of the husk sheath ends with the husk ligule region which is terminated with a diminutive (short) or extended husk leaf (flag leaf). The outer husks (lowermost/most proximal) on the lateral branch (shank) are distichous (in two vertical ranks or rows on opposite sides of an axis) like the adult & juvenile leaves. While the inner (upper) husks are polystichous (arranged in several rows). Note that the term husk (instead of husk sheath) is colloquially used for the modified leaf tissue which surrounds the ear and the term is seldom associated with husk ligule and husk leaf (flag leaf). However, botanically, the term husk should be used for the entire structure (fide Kiesselbach, 1949), comprising the husk sheath, husk ligule and husk leaf (the latter components frequently being very diminutive). The perspective that husks are somewhat homologous with the adult and juvenile leaves justifies the usage of the term husk sheath for the predominant portion of the husk which surrounds the ear.
database_cross_reference: MaizeGDB:kiesselbach (ID# 59445)
database_cross_reference: MaizeGDB:lv (ID# 165572)

husk leaf
type: Class
subclass of: Restriction
  on property: Part of
  some values from: husk
definition: The husk leaf (lamina) is a small (short, reduced - less than 20 mm) portion of modified leaf-blade tissue that is present at the distal end of each husk. The husk leaf region commences with a modified and diminutive ligular region and extends into a tapered lamina which is photosynthetic. The husk leaf is considered to be somewhat homologous with the leaf blade (lamina) of the adult and juvenile leaves. In all occurrences the husk leaf (lamina) lacks the well developed central midrib (midvein) and the widespread lateral veins are much less robust.The husk leaf is reduced in most forms of dent corn. However, in sweet corns the husk leaves are considerably longer (60 mm or longer) and are frequently referred to as flag leaves. These 'flag leaves' should not be confused with the "flag leaf" (ZEA:15148). Where the husk leaves are well developed (flag leaves) the husk leaves are noticeably lacking in rigidity.
database_cross_reference: maizedb:ID# 77179
database_cross_reference: maizedb:http://www.agron.missouri.edu/mnl/60/94bird.html
database_cross_reference: maizedb:http://www.agron.missouri.edu/mnl/77/08has.html
has_obo_namespace: zea_mays_anatomy
has_related_synonym: flag leaves
id: ZEA:0015141

Axiom
annotated source: husk leaf
annotated property: definition
annotated target: The husk leaf (lamina) is a small (short, reduced - less than 20 mm) portion of modified leaf-blade tissue that is present at the distal end of each husk. The husk leaf region commences with a modified and diminutive ligular region and extends into a tapered lamina which is photosynthetic. The husk leaf is considered to be somewhat homologous with the leaf blade (lamina) of the adult and juvenile leaves. In all occurrences the husk leaf (lamina) lacks the well developed central midrib (midvein) and the widespread lateral veins are much less robust.The husk leaf is reduced in most forms of dent corn. However, in sweet corns the husk leaves are considerably longer (60 mm or longer) and are frequently referred to as flag leaves. These 'flag leaves' should not be confused with the "flag leaf" (ZEA:15148). Where the husk leaves are well developed (flag leaves) the husk leaves are noticeably lacking in rigidity.
database_cross_reference: MaizeGDB:ID# 106158
database_cross_reference: MaizeGDB:kiesselbach (ID# 59445)
database_cross_reference: MaizeGDB:lv (ID# 165572)

husk ligule
type: Class
subclass of: Restriction
  on property: Part of
  some values from: husk
definition: The husk ligule in Zea mays is sometimes absent. When present it takes the form of a diminutive protruding line of tissue on the inner/upper (adaxial) surface of the husk leaf at the boundary between the husk sheath and the tapered husk leaf (lamina). As in the ligules of adult and juvenile leaves, this unique line of epidermal tissue appears to be composed of 'fused hairs'. The husk leaf ligule is relatively short (laterally), spanning the width of the tapered end of the distal end of the husk.
has_obo_namespace: zea_mays_anatomy
id: ZEA:0015142

Axiom
annotated source: husk ligule
annotated property: definition
annotated target: The husk ligule in Zea mays is sometimes absent. When present it takes the form of a diminutive protruding line of tissue on the inner/upper (adaxial) surface of the husk leaf at the boundary between the husk sheath and the tapered husk leaf (lamina). As in the ligules of adult and juvenile leaves, this unique line of epidermal tissue appears to be composed of 'fused hairs'. The husk leaf ligule is relatively short (laterally), spanning the width of the tapered end of the distal end of the husk.
database_cross_reference: MaizeGDB:lv (ID# 165572)

gynoecial tissue (abortive) of lower floret of sessile spikelet of tassel
type: Class
subclass of: Restriction
  on property: Part of
  some values from: lower floret of sessile spikelet of tassel
definition: The development of the gynoecial tissue from the floral meristem occurs during the ongoing development of the three stamen primordia.The gynoecial tissue develops via the initiation of an adaxial ridge on the remainder of the floral meristem distal to the three stamens. Soon after initiation the gynoecial tissue begins to abort and subsequently degenerates. This abortion and degeneration of this tissue in the lower floret of the sessile spikelet occurs before the same process occurs in the upper floret.
has_obo_namespace: zea_mays_anatomy
id: ZEA:0015143

Axiom
annotated source: gynoecial tissue (abortive) of lower floret of sessile spikelet of tassel
annotated property: definition
annotated target: The development of the gynoecial tissue from the floral meristem occurs during the ongoing development of the three stamen primordia.The gynoecial tissue develops via the initiation of an adaxial ridge on the remainder of the floral meristem distal to the three stamens. Soon after initiation the gynoecial tissue begins to abort and subsequently degenerates. This abortion and degeneration of this tissue in the lower floret of the sessile spikelet occurs before the same process occurs in the upper floret.
database_cross_reference: MaizeGDB:60893
database_cross_reference: MaizeGDB:lv (ID# 165572)

lodicules of lower floret of sessile spikelet of tassel
type: Class
subclass of: Restriction
  on property: Part of
  some values from: lower floret of sessile spikelet of tassel
definition: Two, small, scale-like. pale-green structures (glandular-like organs) found adjacent to the inner surface of the base of the lemma of the floret. The adjacent margins of the two lodicules (opposite the mid-line of the lemma) are adpressed to each other while the inner surfaces of the lodicules form an angle of approximately 80 degrees to each other. Within the triangle of basal tissue, bounded on two sides by the two lodicules, are located the three filaments of the stamens. Just prior to anthesis the lodicules grow/swell laterally and the triangle of space between the lodicules is almost obscured. The two lodicules are thought to be involved in opening of the grass floret (flower) in readiness for pollination (at anthesis they grow/become increasingly turgid and are presumed to contribute to the displacing of the adjacent lemma and glume which facilitates the exsertion of the anthers for wind pollination). Gibbs Russell et al., Grasses of southern Africa, 1990; Ambrose et al., (2000), Molecular and Genetic Analyses of the Silky1 Gene Reveal Conservation in Floral Organ Specification between Eudicots and Monocots, Molecular Cell 5:569-579. Leszek Vincent 06/2000.
has_obo_namespace: zea_mays_anatomy
id: ZEA:0015144

Axiom
annotated source: lodicules of lower floret of sessile spikelet of tassel
annotated property: definition
annotated target: Two, small, scale-like. pale-green structures (glandular-like organs) found adjacent to the inner surface of the base of the lemma of the floret. The adjacent margins of the two lodicules (opposite the mid-line of the lemma) are adpressed to each other while the inner surfaces of the lodicules form an angle of approximately 80 degrees to each other. Within the triangle of basal tissue, bounded on two sides by the two lodicules, are located the three filaments of the stamens. Just prior to anthesis the lodicules grow/swell laterally and the triangle of space between the lodicules is almost obscured. The two lodicules are thought to be involved in opening of the grass floret (flower) in readiness for pollination (at anthesis they grow/become increasingly turgid and are presumed to contribute to the displacing of the adjacent lemma and glume which facilitates the exsertion of the anthers for wind pollination). Gibbs Russell et al., Grasses of southern Africa, 1990; Ambrose et al., (2000), Molecular and Genetic Analyses of the Silky1 Gene Reveal Conservation in Floral Organ Specification between Eudicots and Monocots, Molecular Cell 5:569-579. Leszek Vincent 06/2000.
database_cross_reference: MaizeGDB:lv (ID# 165572)

lodicules of upper floret of sessile spikelet of tassel
type: Class
subclass of: upper floret of sessile spikelet of tassel
definition: Two, small, scale-like. pale-green structures (glandular-like organs) found adjacent to the inner surface of the base of the lemma of the floret. The adjacent margins of the two lodicules (opposite the mid-line of the lemma) are adpressed to each other while the inner surfaces of the lodicules form an angle of approximately 80 degrees to each other. Within the triangle of basal tissue, bounded on two sides by the two lodicules, are located the three filaments of the stamens. Just prior to anthesis the lodicules grow/swell laterally and the triangle of space between the lodicules is almost obscured. The two lodicules are thought to be involved in opening of the grass floret (flower) in readiness for pollination (at anthesis they grow/become increasingly turgid and are presumed to contribute to the displacing of the adjacent lemma and glume which facilitates the exsertion of the anthers for wind pollination). Gibbs Russell et al., Grasses of southern Africa, 1990; Ambrose et al., (2000), Molecular and Genetic Analyses of the Silky1 Gene Reveal Conservation in Floral Organ Specification between Eudicots and Monocots, Molecular Cell 5:569-579. Leszek Vincent 06/2000.
has_obo_namespace: zea_mays_anatomy
id: ZEA:0015145

Axiom
annotated source: lodicules of upper floret of sessile spikelet of tassel
annotated property: definition
annotated target: Two, small, scale-like. pale-green structures (glandular-like organs) found adjacent to the inner surface of the base of the lemma of the floret. The adjacent margins of the two lodicules (opposite the mid-line of the lemma) are adpressed to each other while the inner surfaces of the lodicules form an angle of approximately 80 degrees to each other. Within the triangle of basal tissue, bounded on two sides by the two lodicules, are located the three filaments of the stamens. Just prior to anthesis the lodicules grow/swell laterally and the triangle of space between the lodicules is almost obscured. The two lodicules are thought to be involved in opening of the grass floret (flower) in readiness for pollination (at anthesis they grow/become increasingly turgid and are presumed to contribute to the displacing of the adjacent lemma and glume which facilitates the exsertion of the anthers for wind pollination). Gibbs Russell et al., Grasses of southern Africa, 1990; Ambrose et al., (2000), Molecular and Genetic Analyses of the Silky1 Gene Reveal Conservation in Floral Organ Specification between Eudicots and Monocots, Molecular Cell 5:569-579. Leszek Vincent 06/2000.
database_cross_reference: MaizeGDB:lv (ID# 165572)

gynoecial tissue (abortive) of upper floret of sessile spikelet of tassel
type: Class
subclass of: upper floret of sessile spikelet of tassel
definition: The development of the gynoecial tissue from the floral meristem occurs during the ongoing development of the three stamen primordia.The gynoecial tissue develops via the initiation of an adaxial ridge on the remainder of the floral meristem distal to the three stamens. Soon after initiation the gynoecial tissue begins to abort and subsequently degenerates. This abortion and degeneration of this tissue in the upper floret of the sessile spikelet occurs after the same process occurs in the lower floret.
has_obo_namespace: zea_mays_anatomy
id: ZEA:0015146

Axiom
annotated source: gynoecial tissue (abortive) of upper floret of sessile spikelet of tassel
annotated property: definition
annotated target: The development of the gynoecial tissue from the floral meristem occurs during the ongoing development of the three stamen primordia.The gynoecial tissue develops via the initiation of an adaxial ridge on the remainder of the floral meristem distal to the three stamens. Soon after initiation the gynoecial tissue begins to abort and subsequently degenerates. This abortion and degeneration of this tissue in the upper floret of the sessile spikelet occurs after the same process occurs in the lower floret.
database_cross_reference: MaizeGDB:60893
database_cross_reference: MaizeGDB:lv (ID# 165572)

gynoecial tissue (abortive) of upper floret of pedicellate spikelet of tassel
type: Class
subclass of: Restriction
  on property: Part of
  some values from: upper floret of pedicellate spikelet of tassel
definition: The development of the gynoecial tissue from the floral meristem occurs during the ongoing development of the three stamen primordia.The gynoecial tissue develops via the initiation of an adaxial ridge on the remainder of the floral meristem distal to the three stamens. Soon after initiation the gynoecial tissue begins to abort and subsequently degenerates. This abortion and degeneration of this tissue in the upper floret of the pedicellate spikelet occurs after the same process occurs in the lower floret.
has_obo_namespace: zea_mays_anatomy
id: ZEA:0015147

Axiom
annotated source: gynoecial tissue (abortive) of upper floret of pedicellate spikelet of tassel
annotated property: definition
annotated target: The development of the gynoecial tissue from the floral meristem occurs during the ongoing development of the three stamen primordia.The gynoecial tissue develops via the initiation of an adaxial ridge on the remainder of the floral meristem distal to the three stamens. Soon after initiation the gynoecial tissue begins to abort and subsequently degenerates. This abortion and degeneration of this tissue in the upper floret of the pedicellate spikelet occurs after the same process occurs in the lower floret.
database_cross_reference: MaizeGDB:lv (ID# 165572)

flag leaf
type: Class
subclass of: adult leaf
definition: The last leaf to emerge in a determinate plant in the Poaceae (determinate growth: formation of a restricted number of lateral organs by an apical meristem; apical meristem terminates growth e.g. tassel & lateral branch meristems). Referred to as the "flag leaf" in cereal (grain) crops. The term 'flag leaf' should not be confused with 'flag leaves' which is a synonym term frequently used for the husk leaf (extended lamina) of the husks of sweet corn varieties. The flag leaf is frequently much less robust than the other adult leaves. In some cases the midrib is much reduced rendering the leaf very mobile.
database_cross_reference: http://www.agriknowledge.co.uk/Dessac/Definitions/finallf.html:; synonym:final leaf
has_obo_namespace: zea_mays_anatomy
id: ZEA:0015148

Axiom
annotated source: flag leaf
annotated property: definition
annotated target: The last leaf to emerge in a determinate plant in the Poaceae (determinate growth: formation of a restricted number of lateral organs by an apical meristem; apical meristem terminates growth e.g. tassel & lateral branch meristems). Referred to as the "flag leaf" in cereal (grain) crops. The term 'flag leaf' should not be confused with 'flag leaves' which is a synonym term frequently used for the husk leaf (extended lamina) of the husks of sweet corn varieties. The flag leaf is frequently much less robust than the other adult leaves. In some cases the midrib is much reduced rendering the leaf very mobile.
database_cross_reference: MaizeGDB:esau (ID# 139825)
database_cross_reference: MaizeGDB:lv (ID # 165572)

tissue
type: Class
subclass of: Restriction
  on property: Part of
  some values from: whole plant
definition: The terms and definitions of the various tissues in Zea mays.
has_obo_namespace: zea_mays_anatomy
id: ZEA:0015149

Axiom
annotated source: tissue
annotated property: definition
annotated target: The terms and definitions of the various tissues in Zea mays.
database_cross_reference: MaizeGDB:lv (ID# 165572)

root apical meristem
type: Class
subclass of: tissue
subclass of: apical meristem
definition: A group of meristematic cells at the apex of the root that by cell division (mitosis) produce the precursors of the primary tissues of the root.
has_obo_namespace: zea_mays_anatomy
id: ZEA:0015150

Axiom
annotated source: root apical meristem
annotated property: definition
annotated target: A group of meristematic cells at the apex of the root that by cell division (mitosis) produce the precursors of the primary tissues of the root.
database_cross_reference: MaizeGDB:Esau (ID# 139825)
database_cross_reference: MaizeGDB:lv (ID# 165572)

shoot apical meristem
type: Class
subclass of: tissue
subclass of: apical meristem
definition: A group of meristematic cells at the apex of the shoot that by cell division (mitosis) produce the precursors of the primary tissues of the shoot; may be vegetative, initiating vegetative tissues and organs, or reproductive, initiating reproductive tissues and organs.
has_obo_namespace: zea_mays_anatomy
id: ZEA:0015151

Axiom
annotated source: shoot apical meristem
annotated property: definition
annotated target: A group of meristematic cells at the apex of the shoot that by cell division (mitosis) produce the precursors of the primary tissues of the shoot; may be vegetative, initiating vegetative tissues and organs, or reproductive, initiating reproductive tissues and organs.
database_cross_reference: MaizeGDB:Esau (ID# 139825)
database_cross_reference: MaizeGDB:lv (ID# 165572)

vegetative meristem
type: Class
subclass of: tissue
has_obo_namespace: zea_mays_anatomy
id: ZEA:0015152

spikelet pair meristem
type: Class
subclass of: tissue
subclass of: Restriction
  on property: Derived/Develops from
  some values from: tassel meristem
subclass of: Restriction
  on property: Derived/Develops from
  some values from: ear meristem
has_obo_namespace: zea_mays_anatomy
id: ZEA:0015153

floret meristem
type: Class
subclass of: tissue
subclass of: Restriction
  on property: Derived/Develops from
  some values from: spikelet pair meristem
definition: The floret meristem is derived/develops from the spikelet meristem. The floret meristem produces the floret (lemma, palea, androecium & gynoecium). Normally two florets are derived from one spikelet meristem.
has_obo_namespace: zea_mays_anatomy
id: ZEA:0015154

Axiom
annotated source: floret meristem
annotated property: definition
annotated target: The floret meristem is derived/develops from the spikelet meristem. The floret meristem produces the floret (lemma, palea, androecium & gynoecium). Normally two florets are derived from one spikelet meristem.
database_cross_reference: MaizeGDB:lv (ID# 165572)

inflorescence meristem
type: Class
subclass of: tissue
subclass of: Restriction
  on property: Derived/Develops from
  some values from: shoot apical meristem
definition: The meristem which produces the tassel and the ear inflorescences. The tassel (functionally male inflorescence) meristem is derived from the apical meristem of the growing point of the determinate culm. An ear meristem is derived from the apical meristem of a lateral branch which produces the ear (functionally female inflorescence).
has_obo_namespace: zea_mays_anatomy
id: ZEA:0015155

Axiom
annotated source: inflorescence meristem
annotated property: definition
annotated target: The meristem which produces the tassel and the ear inflorescences. The tassel (functionally male inflorescence) meristem is derived from the apical meristem of the growing point of the determinate culm. An ear meristem is derived from the apical meristem of a lateral branch which produces the ear (functionally female inflorescence).
database_cross_reference: MaizeGDB:lv (ID# 165572)

tassel meristem
type: Class
subclass of: inflorescence meristem
has_obo_namespace: zea_mays_anatomy
id: ZEA:0015156

ear meristem
type: Class
subclass of: inflorescence meristem
definition: The ear meristem gives rise to numerous spikelet-pair primordia which are arranged in characteristic rows along the longitudinal axis of the ear (functionally female inflorescence). Each spikelet-pair primordium exhibits determinate growth and differentiates into a pedicellate and sessile spikelet (each of these spikelets produces an upper and lower floret).
has_obo_namespace: zea_mays_anatomy
id: ZEA:0015157

Axiom
annotated source: ear meristem
annotated property: definition
annotated target: The ear meristem gives rise to numerous spikelet-pair primordia which are arranged in characteristic rows along the longitudinal axis of the ear (functionally female inflorescence). Each spikelet-pair primordium exhibits determinate growth and differentiates into a pedicellate and sessile spikelet (each of these spikelets produces an upper and lower floret).
database_cross_reference: MaizeGDB:lv (ID# 165572)

lateral root meristem
type: Class
subclass of: tissue
subclass of: Restriction
  on property: Derived/Develops from
  some values from: primary root meristem
definition: The meristem which gives rise to a lateral root (ZEA:15065). These (adventitious) lateral roots emerge from the primary root (radicle, tap root) at varying points behind the zone of root hair formation. They originate from the pericycle.
has_obo_namespace: zea_mays_anatomy
id: ZEA:0015158

Axiom
annotated source: lateral root meristem
annotated property: definition
annotated target: The meristem which gives rise to a lateral root (ZEA:15065). These (adventitious) lateral roots emerge from the primary root (radicle, tap root) at varying points behind the zone of root hair formation. They originate from the pericycle.
database_cross_reference: MaizeGDB:lv (ID# 165572)

axillary meristem
type: Class
subclass of: tissue
definition: The meristem located in the axil of a leaf and giving rise to an axilllary bud. The axillary meristem is initiated in association with the formation of a leaf primordium.
has_obo_namespace: zea_mays_anatomy
id: ZEA:0015159

Axiom
annotated source: axillary meristem
annotated property: definition
annotated target: The meristem located in the axil of a leaf and giving rise to an axilllary bud. The axillary meristem is initiated in association with the formation of a leaf primordium.
database_cross_reference: MaizeGDB:Esau (ID# 139825)
database_cross_reference: MaizeGDB:ID# 402668
database_cross_reference: MaizeGDB:lv (ID# 165572)

adventitious shoot meristem
type: Class
subclass of: tissue
definition: Shoot meristematic tissue arising other than at the apex or in association with a leaf primordium. This is the same meristem which gives rise to shoots, collectively called tillers. Observations indicate that while axillary buds may be involved in adventitious shoot growth (formation of tillers), several of these shoots (tillers) can arise from a single node. These observations suggest that the adventitious shoot meristem is recognizably distinct from the axillary bud meristem.
has_obo_namespace: zea_mays_anatomy
id: ZEA:0015160

Axiom
annotated source: adventitious shoot meristem
annotated property: definition
annotated target: Shoot meristematic tissue arising other than at the apex or in association with a leaf primordium. This is the same meristem which gives rise to shoots, collectively called tillers. Observations indicate that while axillary buds may be involved in adventitious shoot growth (formation of tillers), several of these shoots (tillers) can arise from a single node. These observations suggest that the adventitious shoot meristem is recognizably distinct from the axillary bud meristem.
database_cross_reference: MaizeGDB:lv (ID# 165572)

plate meristem
type: Class
subclass of: tissue
definition: A meristematic tissue consisting of parallel layers of cells dividing anticlinally (perpendicular to the leaf surface). The divisions in this meristem constitute a major part of the intercalary growth by which the leaf reaches its mature size (with respect to surface area; periclinal divisions are responsible for increasing leaf thickness). (Esau, ID#139825; Vincent ID#165572, 2002)
has_obo_namespace: zea_mays_anatomy
id: ZEA:0015161

Axiom
annotated source: plate meristem
annotated property: definition
annotated target: A meristematic tissue consisting of parallel layers of cells dividing anticlinally (perpendicular to the leaf surface). The divisions in this meristem constitute a major part of the intercalary growth by which the leaf reaches its mature size (with respect to surface area; periclinal divisions are responsible for increasing leaf thickness). (Esau, ID#139825; Vincent ID#165572, 2002)
database_cross_reference: MaizeGDB:Esau (ID# 139825)
database_cross_reference: MaizeGDB:lv (ID# 165572)

primary root meristem
type: Class
subclass of: tissue
subclass of: Restriction
  on property: Derived/Develops from
  some values from: root apical meristem
definition: The meristem which gives rise to the primary root (ZEA:15061). The primary root (radicle or tap root) is the initial root structure which emerges from the embryo of the caryopsis (kernel/seed). The primary root is formed early during embryogenesis, becoming defined as a distinctive region 10-15 days after pollination.
has_obo_namespace: zea_mays_anatomy
id: ZEA:0015162

Axiom
annotated source: primary root meristem
annotated property: definition
annotated target: The meristem which gives rise to the primary root (ZEA:15061). The primary root (radicle or tap root) is the initial root structure which emerges from the embryo of the caryopsis (kernel/seed). The primary root is formed early during embryogenesis, becoming defined as a distinctive region 10-15 days after pollination.
database_cross_reference: MaizeGDB:lv (ID# 165572)

seminal root meristem
type: Class
subclass of: tissue
subclass of: Restriction
  on property: Derived/Develops from
  some values from: root apical meristem
has_obo_namespace: zea_mays_anatomy
id: ZEA:0015163

crown root meristem
type: Class
subclass of: tissue
subclass of: Restriction
  on property: Derived/Develops from
  some values from: adventitious root meristem
definition: The meristem which gives rise to the crown roots (ZEA:15066).There are two spatial components of the adventitious root system. 1. A subterranean (below-ground) origin; 2. An aerial (above-ground) origin. The subterranean adventitious roots are frequently called crown roots because they originate from the basal portion of the growing stem known as the crown. The first crown roots (4-5), arranged in a whorl, appear at the base of the second internode about as soon as the tip of the coleoptile reaches the soil surface. A few of the subsequent higher internodes may have a similar number of crown roots (in whorls), after which the successive internodes have more and larger crown roots up to 2-3 internodes above the soil surface.
has_obo_namespace: zea_mays_anatomy
id: ZEA:0015164

Axiom
annotated source: crown root meristem
annotated property: definition
annotated target: The meristem which gives rise to the crown roots (ZEA:15066).There are two spatial components of the adventitious root system. 1. A subterranean (below-ground) origin; 2. An aerial (above-ground) origin. The subterranean adventitious roots are frequently called crown roots because they originate from the basal portion of the growing stem known as the crown. The first crown roots (4-5), arranged in a whorl, appear at the base of the second internode about as soon as the tip of the coleoptile reaches the soil surface. A few of the subsequent higher internodes may have a similar number of crown roots (in whorls), after which the successive internodes have more and larger crown roots up to 2-3 internodes above the soil surface.
database_cross_reference: MaizeGDB:lv (ID# 165572)

prop root meristem
type: Class
subclass of: Restriction
  on property: Derived/Develops from
  some values from: crown root meristem
definition: The meristem which gives rise to the prop roots (ZEA:15068). Prop ('brace') roots are crown roots which have an aerial (above-ground) origin. They emerge from the extreme basal portion of 2-3 internodes above the soil surface.
has_obo_namespace: zea_mays_anatomy
id: ZEA:0015165

Axiom
annotated source: prop root meristem
annotated property: definition
annotated target: The meristem which gives rise to the prop roots (ZEA:15068). Prop ('brace') roots are crown roots which have an aerial (above-ground) origin. They emerge from the extreme basal portion of 2-3 internodes above the soil surface.
database_cross_reference: MaizeGDB:lv (ID# 165572)

subterranean crown root meristem
type: Class
subclass of: Restriction
  on property: Derived/Develops from
  some values from: crown root meristem
definition: The meristem which gives rise to the subterranean crown roots (ZEA:15067).The subterranean crown roots are a component of the adventitious root system. They are termed crown roots because they originate from the basal portion of the growing stem known as the crown. The first subterranean crown roots (4-5), arranged in a whorl, appear at the base of the second internode about as soon as the tip of the coleoptile reaches the soil surface. A few of the subsequent higher internodes may have a similar number of crown roots (in whorls), after which the successive internodes have more and larger crown roots up to 2-3 internodes above the soil surface.
has_obo_namespace: zea_mays_anatomy
id: ZEA:0015166

Axiom
annotated source: subterranean crown root meristem
annotated property: definition
annotated target: The meristem which gives rise to the subterranean crown roots (ZEA:15067).The subterranean crown roots are a component of the adventitious root system. They are termed crown roots because they originate from the basal portion of the growing stem known as the crown. The first subterranean crown roots (4-5), arranged in a whorl, appear at the base of the second internode about as soon as the tip of the coleoptile reaches the soil surface. A few of the subsequent higher internodes may have a similar number of crown roots (in whorls), after which the successive internodes have more and larger crown roots up to 2-3 internodes above the soil surface.
database_cross_reference: MaizeGDB:lv (ID# 165572)

seminal lateral root meristem
type: Class
subclass of: Restriction
  on property: Derived/Develops from
  some values from: seminal root meristem
definition: The meristem which gives rise to the seminal lateral roots (ZEA:15064). Some of the lateral roots of the maize plant comprise the seminal root system. These lateral roots are present in the ungerminated caryopsis (kernel, seed) - they are formed during embryogenesis. The seminal lateral roots arise from 3 to 7 seminal root primordia.
has_obo_namespace: zea_mays_anatomy
id: ZEA:0015167

Axiom
annotated source: seminal lateral root meristem
annotated property: definition
annotated target: The meristem which gives rise to the seminal lateral roots (ZEA:15064). Some of the lateral roots of the maize plant comprise the seminal root system. These lateral roots are present in the ungerminated caryopsis (kernel, seed) - they are formed during embryogenesis. The seminal lateral roots arise from 3 to 7 seminal root primordia.
database_cross_reference: MaizeGDB:lv (ID# 165572)

adventitious root meristem
type: Class
subclass of: tissue
subclass of: Restriction
  on property: Derived/Develops from
  some values from: root apical meristem
definition: The meristem which gives rise to the adventitious root system. The adventitious root system consists of all those roots that arise in the basal intercalary meristem of the lower internodes (above the first internode) of the culm (stem). The adventitious root system comprises the bulk of the lateral roots of the maize plant.
has_obo_namespace: zea_mays_anatomy
id: ZEA:0015168

Axiom
annotated source: adventitious root meristem
annotated property: definition
annotated target: The meristem which gives rise to the adventitious root system. The adventitious root system consists of all those roots that arise in the basal intercalary meristem of the lower internodes (above the first internode) of the culm (stem). The adventitious root system comprises the bulk of the lateral roots of the maize plant.
database_cross_reference: MaizeGDB:lv (ID# 165572)

root branch meristem
type: Class
subclass of: Restriction
  on property: Derived/Develops from
  some values from: lateral root meristem
subclass of: Restriction
  on property: Derived/Develops from
  some values from: prop root meristem
subclass of: Restriction
  on property: Derived/Develops from
  some values from: subterranean crown root meristem
subclass of: Restriction
  on property: Derived/Develops from
  some values from: seminal lateral root meristem
definition: The meristem which gives rise to a root branch (ZEA:15069). A root branch is an adventitious root that emerges from any of the various types of lateral root. Root branches arise at varying points behind (posterior to) the zone of root hair formation on the primary root. Root branches emerge from the surface of the main roots (the various types of lateral roots) at irregular intervals. When a root branches, the initial of each branch is formed from cells of the pericycle. Via cell division a bulging hemispherical mass of meristematic tissue is formed. The outer part of this forms the beginning of the rootcap, while the cells of the growing point are near the flat basal part of the hemispherical mass.
has_obo_namespace: zea_mays_anatomy
id: ZEA:0015169

Axiom
annotated source: root branch meristem
annotated property: definition
annotated target: The meristem which gives rise to a root branch (ZEA:15069). A root branch is an adventitious root that emerges from any of the various types of lateral root. Root branches arise at varying points behind (posterior to) the zone of root hair formation on the primary root. Root branches emerge from the surface of the main roots (the various types of lateral roots) at irregular intervals. When a root branches, the initial of each branch is formed from cells of the pericycle. Via cell division a bulging hemispherical mass of meristematic tissue is formed. The outer part of this forms the beginning of the rootcap, while the cells of the growing point are near the flat basal part of the hemispherical mass.
database_cross_reference: MaizeGDB:lv (ID# 165572)

caryopsis
type: Class
subclass of: gynoecium
subclass of: seed
definition: A dry, one-seeded, indehiscent fruit with the seed coat fused to the pericarp. The caryopsis includes the ovary. The caryopsis is the typical fruit structure of the grass (Poaceae / Gramineae) family.
database_cross_reference: maizedb:ID # 11089
has_obo_namespace: zea_mays_anatomy
has_related_synonym: grain
has_related_synonym: kernel
has_related_synonym: seed
id: ZEA:0015170

Axiom
annotated source: caryopsis
annotated property: definition
annotated target: A dry, one-seeded, indehiscent fruit with the seed coat fused to the pericarp. The caryopsis includes the ovary. The caryopsis is the typical fruit structure of the grass (Poaceae / Gramineae) family.
database_cross_reference: Chapman:The Biology of Grasses - ISBN 0 85199 111 4
database_cross_reference: Harris & Harris:Plant Identification Terminology - An Illustrated Glossary , ISBN 0 9640221 5 X
database_cross_reference: MaizeGDB:lv (ID# 165572)

tiller
type: Class
subclass of: organ
definition: The term tiller is a collective term used for all of the various forms of adventitious shoot which is produced by Zea mays. Tillers are produced by adventitous shoot meristematic tissue (ZEA:xxx). Observations indicate that while axillary buds may be involved in adventitious shoot growth (formation of tillers), several of these shoots (tillers) can arise from a single node.
database_cross_reference: maizedb:ID# 402669
database_cross_reference: maizedb:pldv (ID# 165572)
has_obo_namespace: zea_mays_anatomy
has_related_synonym: adventitious shoot
id: ZEA:0015171

Axiom
annotated source: tiller
annotated property: definition
annotated target: The term tiller is a collective term used for all of the various forms of adventitious shoot which is produced by Zea mays. Tillers are produced by adventitous shoot meristematic tissue (ZEA:xxx). Observations indicate that while axillary buds may be involved in adventitious shoot growth (formation of tillers), several of these shoots (tillers) can arise from a single node.
database_cross_reference: MaizeGDB:lv (ID# 165572)

leaf primordium
type: Class
subclass of: tissue
subclass of: Restriction
  on property: Derived/Develops from
  some values from: founder cells
definition: A leaf primordium is typically referred to as a cell/an organized series of cells in their earliest stage of differentiation with the ontogenetic goal of forming a leaf. A leaf primordium is initiated by cell divisions in the peripheral region of the shoot apex, more or less far below the distal zone of the apical meristem. The first divisions occur in one or more layers beneath the protoderm and are periclinal to the surface of the shoot apex. In Zea the leaf primordium originates from about 250 cells in at least two layers forming a ring of founder cells within the apical meristem tissue associated with the leaf. Each founder cell divides about the same number of times to form the 6 mm square-shaped leaf primordium. The primordial stages of development ends when the lateral veins are complete and the periclinal divisions of the ligule are in progress. Three stages of leaf development are noted: founder cell (meristem founder cell), primordial and postprimordial. The location of each primordium, in relation to the sites of the previously formed leaves, is determined by the phyllotaxy.
has_obo_namespace: zea_mays_anatomy
id: ZEA:0015172

Axiom
annotated source: leaf primordium
annotated property: definition
annotated target: A leaf primordium is typically referred to as a cell/an organized series of cells in their earliest stage of differentiation with the ontogenetic goal of forming a leaf. A leaf primordium is initiated by cell divisions in the peripheral region of the shoot apex, more or less far below the distal zone of the apical meristem. The first divisions occur in one or more layers beneath the protoderm and are periclinal to the surface of the shoot apex. In Zea the leaf primordium originates from about 250 cells in at least two layers forming a ring of founder cells within the apical meristem tissue associated with the leaf. Each founder cell divides about the same number of times to form the 6 mm square-shaped leaf primordium. The primordial stages of development ends when the lateral veins are complete and the periclinal divisions of the ligule are in progress. Three stages of leaf development are noted: founder cell (meristem founder cell), primordial and postprimordial. The location of each primordium, in relation to the sites of the previously formed leaves, is determined by the phyllotaxy.
database_cross_reference: MaizeGDB:Esau (ID# 139825)
database_cross_reference: MaizeGDB:Freeling & Lane (ID# 60922)
database_cross_reference: MaizeGDB:lv (ID# 165572)

apical meristem
type: Class
subclass of: tissue
definition: A group of meristematic cells at the apex of root or shoot that by cell division produce the precursors of the primary tissues of root or shoot. The apical meristem may be vegetative, initiating vegetative tissues and organs, or reproductive, initiating reproductive tissues and organs.
has_obo_namespace: zea_mays_anatomy
id: ZEA:0015173

Axiom
annotated source: apical meristem
annotated property: definition
annotated target: A group of meristematic cells at the apex of root or shoot that by cell division produce the precursors of the primary tissues of root or shoot. The apical meristem may be vegetative, initiating vegetative tissues and organs, or reproductive, initiating reproductive tissues and organs.
database_cross_reference: MaizeGDB:Esau (ID# 139825

founder cells
type: Class
subclass of: Restriction
  on property: Derived/Develops from
  some values from: shoot apical meristem
definition: A group of about 250 cells arranged in at least two layers forming a ring within the shoot apical meristem.
has_obo_namespace: zea_mays_anatomy
id: ZEA:0015174

Axiom
annotated source: founder cells
annotated property: definition
annotated target: A group of about 250 cells arranged in at least two layers forming a ring within the shoot apical meristem.
database_cross_reference: MaizeGDB:Freeling & Lane (ID# 60922)
database_cross_reference: MaizeGDB:lv (ID# 165572)

leaf postprimordium
type: Class
subclass of: Restriction
  on property: Derived/Develops from
  some values from: leaf primordium
has_obo_namespace: zea_mays_anatomy
id: ZEA:0015175

gametophyte
type: Class
subclass of: Restriction
  on property: Part of
  some values from: whole plant
has_obo_namespace: zea_mays_anatomy
id: ZEA:0015176

sporophyte
type: Class
subclass of: whole plant
has_obo_namespace: zea_mays_anatomy
id: ZEA:0015177

seed
type: Class
subclass of: sporophyte
has_obo_namespace: zea_mays_anatomy
id: ZEA:0015178

embryo
type: Class
subclass of: sporophyte
has_obo_namespace: zea_mays_anatomy
id: ZEA:0015179

shoot
type: Class
subclass of: Restriction
  on property: Part of
  some values from: sporophyte
has_obo_namespace: zea_mays_anatomy
id: ZEA:0015180