TEMP
type: Ontology
namespace-id-rule: * CO_321:$sequence(7,0,9999999)$
auto-generated-by: OBO-Edit 2.1-beta4
date: 08:11:2010 15:04
default-namespace: wheat_trait
has_obo_format_version: 1.2
saved-by: RSHRESTHA
comment: Maize trait ontology is prepared by Rosemary Shrestha, CIMMYT for Generation Challenge Program.

definition
type: AnnotationProperty

namespace-id-rule
type: AnnotationProperty

database_cross_reference
type: AnnotationProperty

has_exact_synonym
type: AnnotationProperty

has_obo_format_version
type: AnnotationProperty

has_obo_namespace
type: AnnotationProperty

has_related_synonym
type: AnnotationProperty

CGIAR wheat trait ontology
type: Class
definition: This ontology defines traits of the International Wheat Information System (IWIS) database and wheat descriptor.
has_obo_namespace: wheat_trait
id: CO_321:0000000

Axiom
annotated source: CGIAR wheat trait ontology
annotated property: definition
annotated target: This ontology defines traits of the International Wheat Information System (IWIS) database and wheat descriptor.
database_cross_reference: CO:rs

agronomic trait
type: Class
subclass of: CGIAR wheat trait ontology
has_obo_namespace: wheat_trait
id: CO_321:0000001

morphological trait
type: Class
subclass of: CGIAR wheat trait ontology
has_obo_namespace: wheat_trait
id: CO_321:0000002

quality trait
type: Class
subclass of: CGIAR wheat trait ontology
has_obo_namespace: wheat_trait
id: CO_321:0000003

stress trait
type: Class
subclass of: CGIAR wheat trait ontology
has_obo_namespace: wheat_trait
id: CO_321:0000004

above ground biomass
type: Class
subclass of: agronomic trait
definition: Measurement of total dried above ground biomass in g/plot or kg/ha or kg/plot or ton/ha.
database_cross_reference: IWIS_TRAITID:1164
database_cross_reference: TO:0000327
has_obo_namespace: wheat_trait
has_related_synonym: BIOMAS
has_related_synonym: Biomass yield
id: CO_321:0000005

Axiom
annotated source: above ground biomass
annotated property: definition
annotated target: Measurement of total dried above ground biomass in g/plot or kg/ha or kg/plot or ton/ha.
database_cross_reference: CO:rs

canopy temperature depression
type: Class
subclass of: physiological trait
definition: The difference between air and canopy temperature which is used as a screening tool for wheat yield and stress tolerance in large breeding populations.
database_cross_reference: IWIS_TRAITID:1326
database_cross_reference: TO:0000157
has_obo_namespace: wheat_trait
id: CO_321:0000006
comment: Canopy temperature depression is highly suitable for selecting physiologically superior lines in warm, low relative humidity environments where high evaporative demand leads to leaf cooling of up to 10C below ambient temperatures.

Axiom
annotated source: canopy temperature depression
annotated property: definition
annotated target: The difference between air and canopy temperature which is used as a screening tool for wheat yield and stress tolerance in large breeding populations.
database_cross_reference: http://crops.confex.com/crops/2005am/techprogram/P8099.HTM

days to heading
type: Class
subclass of: agronomic trait
definition: Number of days required for the inflorescence (panicle) to emerge from the flag leaf of a plant or a group of plants in a study.
database_cross_reference: IWIS_TRAITID:1149
database_cross_reference: TO:0000137
has_obo_namespace: wheat_trait
has_related_synonym: DAYHD
has_related_synonym: DTHD
has_related_synonym: heading
has_related_synonym: heading date
id: CO_321:0000007

Axiom
annotated source: days to heading
annotated property: definition
annotated target: Number of days required for the inflorescence (panicle) to emerge from the flag leaf of a plant or a group of plants in a study.
database_cross_reference: TO:0000137

Axiom
annotated source: days to heading
annotated property: has_related_synonym
annotated target: DAYHD
database_cross_reference: IWIS_TRAITID:1149

Axiom
annotated source: days to heading
annotated property: has_related_synonym
annotated target: DTHD
database_cross_reference: TO:0000137

Axiom
annotated source: days to heading
annotated property: has_related_synonym
annotated target: heading
database_cross_reference: IRIS_TRAITID:1019

Axiom
annotated source: days to heading
annotated property: has_related_synonym
annotated target: heading date
database_cross_reference: TO:0000137

days to maturity
type: Class
subclass of: agronomic trait
definition: Number of days from planting to harvest at maturity.
database_cross_reference: IWIS_TRAITID:1150
database_cross_reference: TO:0000469
has_obo_namespace: wheat_trait
has_related_synonym: DAYSMT
has_related_synonym: maturity
id: CO_321:0000008

Axiom
annotated source: days to maturity
annotated property: has_related_synonym
annotated target: DAYSMT
database_cross_reference: IWIS_TRAITID:1150

Axiom
annotated source: days to maturity
annotated property: has_related_synonym
annotated target: maturity
database_cross_reference: IRIS_TRAITID:0000469

Axiom
annotated source: days to maturity
annotated property: definition
annotated target: Number of days from planting to harvest at maturity.
database_cross_reference: CO:rs

early vigor
type: Class
subclass of: agronomic trait
definition: Visual rating of vegetative growth using Zadok growth stages and determine whether it is early or late.
database_cross_reference: IWIS_TRAITID:1167
database_cross_reference: TO:0000296
has_obo_namespace: wheat_trait
has_related_synonym: ERLVIG
has_related_synonym: vegetative vigor
id: CO_321:0000009

Axiom
annotated source: early vigor
annotated property: definition
annotated target: Visual rating of vegetative growth using Zadok growth stages and determine whether it is early or late.
database_cross_reference: CIMMYT:tp
database_cross_reference: CO:rs

Axiom
annotated source: early vigor
annotated property: has_related_synonym
annotated target: ERLVIG
database_cross_reference: IWIS_TRAITID:1167

germination date
type: Class
subclass of: agronomic trait
definition: Record of the day on which a seedling is first observed.
database_cross_reference: IWIS_TRAITID:1366
has_obo_namespace: wheat_trait
has_related_synonym: GERINI
id: CO_321:0000010

Axiom
annotated source: germination date
annotated property: definition
annotated target: Record of the day on which a seedling is first observed.
database_cross_reference: CO:rs

Axiom
annotated source: germination date
annotated property: has_related_synonym
annotated target: GERINI
database_cross_reference: IWIS_TRAITID:1366

germination percentage
type: Class
subclass of: agronomic trait
definition: Percentage of grains that germinate under proper condition.
database_cross_reference: IWIS_TRAITID:1307
database_cross_reference: TO:0010001
has_obo_namespace: wheat_trait
has_related_synonym: GERMI%
has_related_synonym: percent germination
id: CO_321:0000011

Axiom
annotated source: germination percentage
annotated property: definition
annotated target: Percentage of grains that germinate under proper condition.
database_cross_reference: CO:rs

Axiom
annotated source: germination percentage
annotated property: has_related_synonym
annotated target: GERMI%
database_cross_reference: IWIS_TRAITID:1307

grain moisture content
type: Class
subclass of: quality trait
definition: Moisture content of grain measured by grain moisture analyzer in percentage.
database_cross_reference: IWIS_TRAITID:1155
database_cross_reference: TO:0000057
has_obo_namespace: wheat_trait
has_related_synonym: GRNH20
has_related_synonym: grain moisture
id: CO_321:0000012

Axiom
annotated source: grain moisture content
annotated property: definition
annotated target: Moisture content of grain measured by grain moisture analyzer in percentage.
database_cross_reference: CO:rs

Axiom
annotated source: grain moisture content
annotated property: has_related_synonym
annotated target: GRNH20
database_cross_reference: IWIS_TRAITID:1155

grain yield
type: Class
subclass of: agronomic trait
definition: Grain yield is the product of accumulating dry matter (i.e., biomass) and allocating a portion of the total aboveground biomass to the grain. It is measured in g/plot.
database_cross_reference: IWIS_TRAITID:1144
database_cross_reference: TO:0000396
has_obo_namespace: wheat_trait
has_related_synonym: GRNYLD
id: CO_321:0000013

Axiom
annotated source: grain yield
annotated property: definition
annotated target: Grain yield is the product of accumulating dry matter (i.e., biomass) and allocating a portion of the total aboveground biomass to the grain. It is measured in g/plot.
database_cross_reference: CO:rs

Axiom
annotated source: grain yield
annotated property: has_related_synonym
annotated target: GRNYLD
database_cross_reference: IWIS_TRAITID:1144

ground cover
type: Class
subclass of: agronomic trait
definition: Measurement of ground surface covered by the plant in percentage at 5 leaf stage.
database_cross_reference: IWIS_TRAITID:1285
has_obo_namespace: wheat_trait
has_related_synonym: GRCOV5
id: CO_321:0000014
comment: It is measured in percentage at 5 leaf stage.

Axiom
annotated source: ground cover
annotated property: definition
annotated target: Measurement of ground surface covered by the plant in percentage at 5 leaf stage.
database_cross_reference: CIMMYT:tp
database_cross_reference: CO:rs

Axiom
annotated source: ground cover
annotated property: has_related_synonym
annotated target: GRCOV5
database_cross_reference: IWIS_TRAITID:1285

growth habit
type: Class
subclass of: agronomic trait
definition: A qualitative description of the growth habit of the plant whether erect/semi-erect/prostrate/spreading/semi-spreading.
database_cross_reference: IWIS_TRAITID:1310
database_cross_reference: TO:0002756
has_obo_namespace: wheat_trait
has_related_synonym: GHABIT
id: CO_321:0000015

Axiom
annotated source: growth habit
annotated property: definition
annotated target: A qualitative description of the growth habit of the plant whether erect/semi-erect/prostrate/spreading/semi-spreading.
database_cross_reference: CIMMYT:jb
database_cross_reference: CO:rs

Axiom
annotated source: growth habit
annotated property: has_related_synonym
annotated target: GHABIT
database_cross_reference: IWIS_TRAITID:1310

growth stage
type: Class
subclass of: agronomic trait
definition: Visual observation of growth stages based on Zadok Decimal code.
database_cross_reference: IWIS_TRAITID:1374
has_obo_namespace: wheat_trait
has_related_synonym: GRWSTG
id: CO_321:0000016

Axiom
annotated source: growth stage
annotated property: definition
annotated target: Visual observation of growth stages based on Zadok Decimal code.
database_cross_reference: CO:rs

Axiom
annotated source: growth stage
annotated property: has_related_synonym
annotated target: GRWSTG
database_cross_reference: IWIS_TRAITID:1374

initial germination value
type: Class
subclass of: agronomic trait
database_cross_reference: IWIS_TRAITID:1367
has_obo_namespace: wheat_trait
has_related_synonym: GERVAL
id: CO_321:0000017

Axiom
annotated source: initial germination value
annotated property: has_related_synonym
annotated target: GERVAL
database_cross_reference: IWIS_TRAITID:1367

leaf conductance
type: Class
subclass of: physiological trait
definition: Rate of passage of either water vapor or carbon dioxide through the stomata.
database_cross_reference: IWIS_TRAITID:1403
database_cross_reference: TO:0000522
has_obo_namespace: wheat_trait
has_related_synonym: LEFCND
id: CO_321:0000018

Axiom
annotated source: leaf conductance
annotated property: definition
annotated target: Rate of passage of either water vapor or carbon dioxide through the stomata.
database_cross_reference: CIMMYT:mr
database_cross_reference: CO:rs

Axiom
annotated source: leaf conductance
annotated property: has_related_synonym
annotated target: LEFCND
database_cross_reference: IWIS_TRAITID:1403

moisture percentage
type: Class
subclass of: agronomic trait
definition: Total percentage of water in wheat.
database_cross_reference: IWIS_TRAITID:1369
has_obo_namespace: wheat_trait
id: CO_321:0000019

Axiom
annotated source: moisture percentage
annotated property: definition
annotated target: Total percentage of water in wheat.
database_cross_reference: CO:rs

plant height
type: Class
subclass of: agronomic trait
definition: Height of plant at maturity, measured in cm from ground to top of spike, excluding awns.
database_cross_reference: IWIS_TRAITID:1151
database_cross_reference: TO:0000207
has_obo_namespace: wheat_trait
has_related_synonym: PLNTHT
id: CO_321:0000020

Axiom
annotated source: plant height
annotated property: definition
annotated target: Height of plant at maturity, measured in cm from ground to top of spike, excluding awns.
database_cross_reference: AGPG:IBPGR/85/210

Axiom
annotated source: plant height
annotated property: has_related_synonym
annotated target: PLNTHT
database_cross_reference: IWIS_TRAITID:1151

days to seedling emergence
type: Class
subclass of: morphological trait
created by: RSHRESTHA
creation date: 2009-08-10T02:49:13Z
has_obo_namespace: wheat_trait
id: CO_321:0000021

relative maturity
type: Class
subclass of: agronomic trait
definition: Ratio of the maturity days that determined from the plant to best local check which represents the best locally adopted germplasm at each location grown in standard or normal environment.
database_cross_reference: IWIS_TRAITID:1386
has_obo_namespace: wheat_trait
has_related_synonym: RELTHD
id: CO_321:0000022

Axiom
annotated source: relative maturity
annotated property: definition
annotated target: Ratio of the maturity days that determined from the plant to best local check which represents the best locally adopted germplasm at each location grown in standard or normal environment.
database_cross_reference: CIMMYT:tp
database_cross_reference: CO:rs

Axiom
annotated source: relative maturity
annotated property: has_related_synonym
annotated target: RELTHD
database_cross_reference: IWIS_TRAITID:1385

relative heading
type: Class
subclass of: agronomic trait
definition: Ratio of the heading days that determined from the plant to best local check which represents the best locally adopted germplasm at each location grown in standard or normal environment.
database_cross_reference: IWIS_TRAITID:1385
has_obo_namespace: wheat_trait
has_related_synonym: RELTMT
id: CO_321:0000023

Axiom
annotated source: relative heading
annotated property: definition
annotated target: Ratio of the heading days that determined from the plant to best local check which represents the best locally adopted germplasm at each location grown in standard or normal environment.
database_cross_reference: CIMMYT:tp
database_cross_reference: CO:rs

Axiom
annotated source: relative heading
annotated property: has_related_synonym
annotated target: RELTMT
database_cross_reference: IWIS_TRAITID:1386

relative plant height
type: Class
subclass of: agronomic trait
definition: Ratio of the plant height determined from the plant to local check which represents the best locally adopted germplasm at each location grown in standard or normal environment.
database_cross_reference: IWIS_TRAITID:1387
database_cross_reference: TO:0001034
has_obo_namespace: wheat_trait
has_related_synonym: RELPHT
id: CO_321:0000024

Axiom
annotated source: relative plant height
annotated property: definition
annotated target: Ratio of the plant height determined from the plant to local check which represents the best locally adopted germplasm at each location grown in standard or normal environment.
database_cross_reference: CIMMYT:tp
database_cross_reference: CO:rs

Axiom
annotated source: relative plant height
annotated property: has_related_synonym
annotated target: RELPHT
database_cross_reference: IWIS_TRAITID:1387

1000-grain weight
type: Class
subclass of: morphological trait
definition: Measurement of 1000 well-developed grains in grams.
database_cross_reference: IWIS_TRAITID:1147
database_cross_reference: TO:0000382
has_obo_namespace: wheat_trait
has_related_synonym: 1000-seed weight
has_related_synonym: 1000GW
has_related_synonym: THOUWT
id: CO_321:0000025

Axiom
annotated source: 1000-grain weight
annotated property: definition
annotated target: Measurement of 1000 well-developed grains in grams.
database_cross_reference: CO:rs

Axiom
annotated source: 1000-grain weight
annotated property: has_related_synonym
annotated target: 1000-seed weight
database_cross_reference: TO:0000382

Axiom
annotated source: 1000-grain weight
annotated property: has_related_synonym
annotated target: THOUWT
database_cross_reference: IWIS_TRAITID:1147

awn length
type: Class
subclass of: morphological trait
definition: Measurement of awn length in cm (centimeter).
database_cross_reference: IWIS_TRAITID:1417
database_cross_reference: TO:0000072
has_obo_namespace: wheat_trait
has_related_synonym: AWNLNG
id: CO_321:0000026

Axiom
annotated source: awn length
annotated property: definition
annotated target: Measurement of awn length in cm (centimeter).
database_cross_reference: CO:rs

Axiom
annotated source: awn length
annotated property: has_related_synonym
annotated target: AWNLNG
database_cross_reference: IWIS_TRAITID:1417

awnedness
type: Class
subclass of: morphological trait
definition: Observation of awn type whether awnless/awnletted (short awns)/awned (conspicious awns).
database_cross_reference: TO:0002734
has_obo_namespace: wheat_trait
has_related_synonym: awn presence
id: CO_321:0000027

Axiom
annotated source: awnedness
annotated property: definition
annotated target: Observation of awn type whether awnless/awnletted (short awns)/awned (conspicious awns).
database_cross_reference: CO:rs

chlorophyll content
type: Class
subclass of: physiological trait
definition: Measures the chlorophyll content in a green tissue. Includes both chlorophyll-a and chlorophyll-b. Chlorophyll is the green pigment found in plants.
database_cross_reference: IWIS_TRAITID:1402
has_obo_namespace: wheat_trait
has_related_synonym: CLPHYL
id: CO_321:0000028

Axiom
annotated source: chlorophyll content
annotated property: definition
annotated target: Measures the chlorophyll content in a green tissue. Includes both chlorophyll-a and chlorophyll-b. Chlorophyll is the green pigment found in plants.
database_cross_reference: TO:0000495

Axiom
annotated source: chlorophyll content
annotated property: has_related_synonym
annotated target: CLPHYL
database_cross_reference: IWIS_TRAITID:1402

coleoptile length
type: Class
subclass of: morphological trait
definition: Length of coleoptile (a protective sheath that surrounds the shoot tip and the embryonic leaves of the young shoot of grasses) is measured in cm (centimeter).
database_cross_reference: IWIS_TRAITID:1425
database_cross_reference: TO:0001007
has_obo_namespace: wheat_trait
has_related_synonym: CLPLNG
id: CO_321:0000029

Axiom
annotated source: coleoptile length
annotated property: definition
annotated target: Length of coleoptile (a protective sheath that surrounds the shoot tip and the embryonic leaves of the young shoot of grasses) is measured in cm (centimeter).
database_cross_reference: CO:rs

Axiom
annotated source: coleoptile length
annotated property: has_related_synonym
annotated target: CLPLNG
database_cross_reference: IWIS_TRAITID:1425

days to flag leaf emergence
type: Class
subclass of: morphological trait
database_cross_reference: IWIS_TRAITID:1004
has_obo_namespace: wheat_trait
has_related_synonym: EMERGE
id: CO_321:0000030

Axiom
annotated source: days to flag leaf emergence
annotated property: has_related_synonym
annotated target: EMERGE
database_cross_reference: IWIS_TRAITID:1004

glume color
type: Class
subclass of: morphological trait
definition: Color observation on the outer glume whether white/red to brown/purple to black at maturity.
database_cross_reference: IWIS_TRAITID:1372
database_cross_reference: TO:0000221
has_obo_namespace: wheat_trait
has_related_synonym: GLMCOL
id: CO_321:0000031

Axiom
annotated source: glume color
annotated property: definition
annotated target: Color observation on the outer glume whether white/red to brown/purple to black at maturity.
database_cross_reference: AGPG:IBPGR/85/210

Axiom
annotated source: glume color
annotated property: has_related_synonym
annotated target: GLMCOL
database_cross_reference: IWIS_TRAITID:1372

glume length
type: Class
subclass of: morphological trait
definition: Length of glume measured in mm (millimeter).
database_cross_reference: IWIS_TRAITID:1420
has_obo_namespace: wheat_trait
has_related_synonym: GLMLNG
id: CO_321:0000032

Axiom
annotated source: glume length
annotated property: definition
annotated target: Length of glume measured in mm (millimeter).
database_cross_reference: CO:rs

Axiom
annotated source: glume length
annotated property: has_related_synonym
annotated target: GLMLNG
database_cross_reference: IWIS_TRAITID:1420

glume pubescence density
type: Class
subclass of: morphological trait
definition: Measurement of glume hairiness density on outer side of sterile glume.
database_cross_reference: IWIS_TRAITID:1422
has_obo_namespace: wheat_trait
has_related_synonym: GLMPDN
id: CO_321:0000033

Axiom
annotated source: glume pubescence density
annotated property: definition
annotated target: Measurement of glume hairiness density on outer side of sterile glume.
database_cross_reference: CO:rs

Axiom
annotated source: glume pubescence density
annotated property: has_related_synonym
annotated target: GLMPDN
database_cross_reference: IWIS_TRAITID:1423

glume pubescence length
type: Class
subclass of: morphological trait
created by: RSHRESTHA
creation date: 2009-08-10T02:50:25Z
database_cross_reference: IWIS_TRAITID:1423
has_obo_namespace: wheat_trait
id: CO_321:0000034

glume waxiness
type: Class
subclass of: morphological trait
definition: Measurement of presence of wax in glume.
database_cross_reference: IWIS_TRAITID:1412
has_obo_namespace: wheat_trait
has_related_synonym: GLMWAX
id: CO_321:0000035

Axiom
annotated source: glume waxiness
annotated property: definition
annotated target: Measurement of presence of wax in glume.
database_cross_reference: CO:rs

Axiom
annotated source: glume waxiness
annotated property: has_related_synonym
annotated target: GLMWAX
database_cross_reference: IWIS_TRAITID:1412

glume width
type: Class
subclass of: morphological trait
definition: Measurement of width of glume in mm (millimeter).
database_cross_reference: IWIS_TRAITID:1421
has_obo_namespace: wheat_trait
has_related_synonym: GLMWID
id: CO_321:0000036

Axiom
annotated source: glume width
annotated property: definition
annotated target: Measurement of width of glume in mm (millimeter).
database_cross_reference: CO:rs

Axiom
annotated source: glume width
annotated property: has_related_synonym
annotated target: GLMWID
database_cross_reference: IWIS_TRAITID:1421

grain color
type: Class
subclass of: morphological trait
definition: Visual measurement of grain color whether white/red/purple at maturity.
database_cross_reference: IWIS_TRAITID:1286
database_cross_reference: TO:0002617
has_obo_namespace: wheat_trait
has_related_synonym: GRNCOL
has_related_synonym: fruit color
id: CO_321:0000037

Axiom
annotated source: grain color
annotated property: definition
annotated target: Visual measurement of grain color whether white/red/purple at maturity.
database_cross_reference: AGPG:IBPGR/85/210

Axiom
annotated source: grain color
annotated property: has_related_synonym
annotated target: GRNCOL
database_cross_reference: IWIS_TRAITID:1286

grain per spike
type: Class
subclass of: morphological trait
definition: Count of total number of grains on an average of five spikes.
database_cross_reference: IWIS_TRAITID:1156
database_cross_reference: TO:0002759
has_obo_namespace: wheat_trait
has_related_synonym: GRNSPK
has_related_synonym: grain per panicle
id: CO_321:0000038

Axiom
annotated source: grain per spike
annotated property: definition
annotated target: Count of total number of grains on an average of five spikes.
database_cross_reference: CO:rs

Axiom
annotated source: grain per spike
annotated property: has_related_synonym
annotated target: GRNSPK
database_cross_reference: IWIS_TRAITID:1156

grain plumpness
type: Class
subclass of: quality trait
definition: A qualitative trait measuring degree of endosperm has filled.
database_cross_reference: IWIS_TRAITID:1235
has_obo_namespace: wheat_trait
has_related_synonym: GRNPLU
id: CO_321:0000039
comment: This trait is to determine shrunken kernels resulting from stress (drought, heat), or resulting from effects of plant diseases not allowing the crop to finish up grain filling properly.

Axiom
annotated source: grain plumpness
annotated property: definition
annotated target: A qualitative trait measuring degree of endosperm has filled.
database_cross_reference: CIMMYT:jp
database_cross_reference: CIMMYT:tp�
database_cross_reference: CO:rs �AGPG:IBPGR/85/210

Axiom
annotated source: grain plumpness
annotated property: has_related_synonym
annotated target: GRNPLU
database_cross_reference: IWIS_TRAITID:1235

grain size
type: Class
subclass of: morphological trait
definition: Measurement of grain size in cm (centimeter).
database_cross_reference: IWIS_TRAITID:1136
database_cross_reference: TO:0000391
has_obo_namespace: wheat_trait
has_related_synonym: GRNSIZ
id: CO_321:0000040

Axiom
annotated source: grain size
annotated property: definition
annotated target: Measurement of grain size in cm (centimeter).
database_cross_reference: AGPG:IBPGR/85/210

Axiom
annotated source: grain size
annotated property: has_related_synonym
annotated target: GRNSIZ
database_cross_reference: IWIS_TRAITID:1136

grain per spikelet
type: Class
subclass of: morphological trait
definition: The total numbers of grains per spikelet.
database_cross_reference: IWIS_TRAITID:1419
has_obo_namespace: wheat_trait
has_related_synonym: GRNSPL
id: CO_321:0000041

Axiom
annotated source: grain per spikelet
annotated property: definition
annotated target: The total numbers of grains per spikelet.
database_cross_reference: CO:rs

Axiom
annotated source: grain per spikelet
annotated property: has_related_synonym
annotated target: GRNSPL
database_cross_reference: IWIS_TRAITID:1419

seed vitreousness
type: Class
subclass of: quality trait
definition: One of the key quality parameters in the determination of Durum quality referring to translucent or glass-like appearance when seeds are transversely sectioned and observed whether not vitreous/partly vitreous/vitreous. It is associated with high protein and hard grain.
has_obo_namespace: wheat_trait
has_related_synonym: grain vitreousness
id: CO_321:0000042
comment: Partly vitreous endosperm is related to the efficiency in N fertilization to allow accumulation of acceptable levels of protein content in the grain. Deficient N fertilization results in low grain protein content and starchy patches in the endosperm.

Axiom
annotated source: seed vitreousness
annotated property: definition
annotated target: One of the key quality parameters in the determination of Durum quality referring to translucent or glass-like appearance when seeds are transversely sectioned and observed whether not vitreous/partly vitreous/vitreous. It is associated with high protein and hard grain.
database_cross_reference: CIMMYT:jp�
database_cross_reference: CO:rs �AGPG:IBPGR/85/210

kernel texture
type: Class
subclass of: morphological trait
definition: Visual observation of the relative hardness of a kernel whether soft/intermediate/hard .
database_cross_reference: IWIS_TRAITID:1183
has_obo_namespace: wheat_trait
has_related_synonym: KERAPP
has_related_synonym: kernel appearance
has_related_synonym: seed texture
id: CO_321:0000043

Axiom
annotated source: kernel texture
annotated property: definition
annotated target: Visual observation of the relative hardness of a kernel whether soft/intermediate/hard .
database_cross_reference: CO:rs

Axiom
annotated source: kernel texture
annotated property: has_related_synonym
annotated target: KERAPP
database_cross_reference: IWIS_TRAITID:1183

leaf length
type: Class
subclass of: morphological trait
definition: Actual measurement of leaf length in cm (centimeter).
database_cross_reference: IWIS_TRAITID:1404
database_cross_reference: TO:0000135
has_obo_namespace: wheat_trait
has_related_synonym: LEFLNG
id: CO_321:0000044

Axiom
annotated source: leaf length
annotated property: definition
annotated target: Actual measurement of leaf length in cm (centimeter).
database_cross_reference: CO:rs

Axiom
annotated source: leaf length
annotated property: has_related_synonym
annotated target: LEFLNG
database_cross_reference: IWIS_TRAITID:1404

leaf pubescence density
type: Class
subclass of: morphological trait
definition: Measurement of leaf hairiness density.
database_cross_reference: IWIS_TRAITID:1407
has_obo_namespace: wheat_trait
has_related_synonym: LFPDEN
id: CO_321:0000045

Axiom
annotated source: leaf pubescence density
annotated property: definition
annotated target: Measurement of leaf hairiness density.
database_cross_reference: CO:rs

Axiom
annotated source: leaf pubescence density
annotated property: has_related_synonym
annotated target: LFPDEN
database_cross_reference: IWIS_TRAITID:1407

leaf pubescence length
type: Class
subclass of: morphological trait
created by: RSHRESTHA
creation date: 2009-08-10T02:51:27Z
database_cross_reference: IWIS_TRAITID:1408
has_obo_namespace: wheat_trait
id: CO_321:0000046

leaf thickness
type: Class
subclass of: morphological trait
definition: Measurement of leaf thickness in mm (millimeter).
database_cross_reference: IWIS_TRAITID:1406
database_cross_reference: TO:0000258
has_obo_namespace: wheat_trait
has_related_synonym: LEFTHK
id: CO_321:0000047

Axiom
annotated source: leaf thickness
annotated property: definition
annotated target: Measurement of leaf thickness in mm (millimeter).
database_cross_reference: CO:rs

Axiom
annotated source: leaf thickness
annotated property: has_related_synonym
annotated target: LEFTHK
database_cross_reference: IWIS_TRAITID:1406

leaf waxiness
type: Class
subclass of: morphological trait
definition: Visual observation of presence of wax in leaf.
database_cross_reference: IWIS_TRAITID:1410
database_cross_reference: TO:0000709
has_obo_namespace: wheat_trait
has_related_synonym: LEFWAX
has_related_synonym: leaf gloss
id: CO_321:0000048

Axiom
annotated source: leaf waxiness
annotated property: definition
annotated target: Visual observation of presence of wax in leaf.
database_cross_reference: CO:rs

Axiom
annotated source: leaf waxiness
annotated property: has_related_synonym
annotated target: LEFWAX
database_cross_reference: IWIS_TRAITID:1410

leaf width
type: Class
subclass of: morphological trait
definition: Measurement of leaf width in mm (millimeter).
database_cross_reference: IWIS_TRAITID:1405
database_cross_reference: TO:0000370
has_obo_namespace: wheat_trait
has_related_synonym: LEFWID
id: CO_321:0000049

Axiom
annotated source: leaf width
annotated property: definition
annotated target: Measurement of leaf width in mm (millimeter).
database_cross_reference: CO:rs

Axiom
annotated source: leaf width
annotated property: has_related_synonym
annotated target: LEFWID
database_cross_reference: IWIS_TRAITID:1405

neck break
type: Class
subclass of: morphological trait
definition: Observation of spike break from the base of head.
database_cross_reference: IWIS_TRAITID:1163
has_obo_namespace: wheat_trait
has_related_synonym: NBREAK
id: CO_321:0000050

Axiom
annotated source: neck break
annotated property: definition
annotated target: Observation of spike break from the base of head.
database_cross_reference: CO:rs

Axiom
annotated source: neck break
annotated property: has_related_synonym
annotated target: NBREAK
database_cross_reference: IWIS_TRAITID:1163

node number
type: Class
subclass of: morphological trait
definition: Number of nodes on stem.
database_cross_reference: IWIS_TRAITID:1413
has_obo_namespace: wheat_trait
has_related_synonym: NODENU
id: CO_321:0000051

Axiom
annotated source: node number
annotated property: definition
annotated target: Number of nodes on stem.
database_cross_reference: TO:0000634

Axiom
annotated source: node number
annotated property: has_related_synonym
annotated target: NODENU
database_cross_reference: IWIS_TRAITID:1413

peduncle length
type: Class
subclass of: morphological trait
definition: Measurement of peduncle length in cm (centimeter).
database_cross_reference: IWIS_TRAITID:1400
database_cross_reference: TO:0002691
has_obo_namespace: wheat_trait
has_related_synonym: PEDLN1
has_related_synonym: PEDLN2
has_related_synonym: PEDLN3
has_related_synonym: PEDLN4
has_related_synonym: PEDLN5
has_related_synonym: PEDLNG
id: CO_321:0000052

Axiom
annotated source: peduncle length
annotated property: definition
annotated target: Measurement of peduncle length in cm (centimeter).
database_cross_reference: CO:rs

Axiom
annotated source: peduncle length
annotated property: has_related_synonym
annotated target: PEDLN1
database_cross_reference: IWIS_TRAITID:1394

Axiom
annotated source: peduncle length
annotated property: has_related_synonym
annotated target: PEDLN2
database_cross_reference: IWIS_TRAITID:1395

Axiom
annotated source: peduncle length
annotated property: has_related_synonym
annotated target: PEDLN3
database_cross_reference: IWIS_TRAITID:1396

Axiom
annotated source: peduncle length
annotated property: has_related_synonym
annotated target: PEDLN4
database_cross_reference: IWIS_TRAITID:1397

Axiom
annotated source: peduncle length
annotated property: has_related_synonym
annotated target: PEDLN5
database_cross_reference: IWIS_TRAITID:1398

Axiom
annotated source: peduncle length
annotated property: has_related_synonym
annotated target: PEDLNG
database_cross_reference: IWIS_TRAITID:1400

peduncle pubescence density
type: Class
subclass of: morphological trait
definition: Measurement of peduncle hairiness density.
database_cross_reference: IWIS_TRAITID:1409
has_obo_namespace: wheat_trait
has_related_synonym: PEDPBD
id: CO_321:0000053

Axiom
annotated source: peduncle pubescence density
annotated property: definition
annotated target: Measurement of peduncle hairiness density.
database_cross_reference: CO:rs

Axiom
annotated source: peduncle pubescence density
annotated property: has_related_synonym
annotated target: PEDPBD
database_cross_reference: IWIS_TRAITID:1409

peduncle waxiness
type: Class
subclass of: morphological trait
definition: Visual observation of presence of wax in peduncle.
database_cross_reference: IWIS_TRAITID:1411
has_obo_namespace: wheat_trait
has_related_synonym: PEDWAX
id: CO_321:0000054

Axiom
annotated source: peduncle waxiness
annotated property: definition
annotated target: Visual observation of presence of wax in peduncle.
database_cross_reference: CO:rs

Axiom
annotated source: peduncle waxiness
annotated property: has_related_synonym
annotated target: PEDWAX
database_cross_reference: IWIS_TRAITID:1411

spike density
type: Class
subclass of: morphological trait
definition: A visual measure of density of a wheat spike.
database_cross_reference: IWIS_TRAITID:1424
has_obo_namespace: wheat_trait
has_related_synonym: SPKDEN
id: CO_321:0000055

Axiom
annotated source: spike density
annotated property: has_related_synonym
annotated target: SPKDEN
database_cross_reference: IWIS_TRAITID:1424

Axiom
annotated source: spike density
annotated property: definition
annotated target: A visual measure of density of a wheat spike.
database_cross_reference: AGPG:IBPGR/85/210

spike length
type: Class
subclass of: morphological trait
definition: Measurement of spike length in cm (centimeter).
database_cross_reference: IWIS_TRAITID:1416
database_cross_reference: TO:0000040
has_obo_namespace: wheat_trait
has_related_synonym: SPKLNG
has_related_synonym: spikelet length
id: CO_321:0000056

Axiom
annotated source: spike length
annotated property: definition
annotated target: Measurement of spike length in cm (centimeter).
database_cross_reference: CO:rs

Axiom
annotated source: spike length
annotated property: has_related_synonym
annotated target: SPKLNG
database_cross_reference: IWIS_TRAITID:1416

spike shattering
type: Class
subclass of: morphological trait
definition: Observation of grains dehiscence from spike at maturity.
database_cross_reference: IWIS_TRAITID:1162
has_obo_namespace: wheat_trait
has_related_synonym: FRGFWT
id: CO_321:0000057

Axiom
annotated source: spike shattering
annotated property: definition
annotated target: Observation of grains dehiscence from spike at maturity.
database_cross_reference: CIMMYT:tp
database_cross_reference: CO:rs

Axiom
annotated source: spike shattering
annotated property: has_related_synonym
annotated target: FRGFWT
database_cross_reference: IWIS_TRAITID:1162

spikelet per spike
type: Class
subclass of: morphological trait
definition: Number of spikelets per spike based on the average of five spikes.
database_cross_reference: IWIS_TRAITID:1418
database_cross_reference: TO:0000565
has_obo_namespace: wheat_trait
has_related_synonym: SPLSPK
has_related_synonym: panicle length
id: CO_321:0000058

Axiom
annotated source: spikelet per spike
annotated property: definition
annotated target: Number of spikelets per spike based on the average of five spikes.
database_cross_reference: AGPG:IBPGR/85/210

Axiom
annotated source: spikelet per spike
annotated property: has_related_synonym
annotated target: SPLSPK
database_cross_reference: IWIS_TRAITID:1418

stay green
type: Class
subclass of: morphological trait
definition: The color of plant and the photosynthetic organs remain green compared to turning yellow and or brown at the time of senescing.
database_cross_reference: IWIS_TRAITID:1166
database_cross_reference: TO:0002712
has_obo_namespace: wheat_trait
has_related_synonym: STAGRE
id: CO_321:0000059

Axiom
annotated source: stay green
annotated property: definition
annotated target: The color of plant and the photosynthetic organs remain green compared to turning yellow and or brown at the time of senescing.
database_cross_reference: CO:rs

Axiom
annotated source: stay green
annotated property: has_related_synonym
annotated target: STAGRE
database_cross_reference: IWIS_TRAITID:1166

stem height
type: Class
subclass of: morphological trait
definition: Measurement of stem height in cm (centimeter).
database_cross_reference: IWIS_TRAITID:1399
database_cross_reference: TO:0000576
has_obo_namespace: wheat_trait
has_related_synonym: STMHG
has_related_synonym: STMHG1
has_related_synonym: STMHG2
has_related_synonym: STMHG3
has_related_synonym: STMHG4
has_related_synonym: STMHG5
id: CO_321:0000060

Axiom
annotated source: stem height
annotated property: definition
annotated target: Measurement of stem height in cm (centimeter).
database_cross_reference: CO:rs

Axiom
annotated source: stem height
annotated property: has_related_synonym
annotated target: STMHG
database_cross_reference: IWIS_TRAITID:1399

Axiom
annotated source: stem height
annotated property: has_related_synonym
annotated target: STMHG1
database_cross_reference: IWIS_TRAITID:1389

Axiom
annotated source: stem height
annotated property: has_related_synonym
annotated target: STMHG2
database_cross_reference: IWIS_TRAITID:1390

Axiom
annotated source: stem height
annotated property: has_related_synonym
annotated target: STMHG3
database_cross_reference: IWIS_TRAITID:1391

Axiom
annotated source: stem height
annotated property: has_related_synonym
annotated target: STMHG4
database_cross_reference: IWIS_TRAITID:1392

Axiom
annotated source: stem height
annotated property: has_related_synonym
annotated target: STMHG5
database_cross_reference: IWIS_TRAITID:1393

stem solidness
type: Class
subclass of: morphological trait
definition: The trait evaluates the solidness of stem as either solid/intermediate or hollowness.
database_cross_reference: IWIS_TRAITID:1415
has_obo_namespace: wheat_trait
has_related_synonym: STMSOL
has_related_synonym: stem hollowness
id: CO_321:0000061

Axiom
annotated source: stem solidness
annotated property: definition
annotated target: The trait evaluates the solidness of stem as either solid/intermediate or hollowness.
database_cross_reference: CIMMYT:tp
database_cross_reference: CO:rs

Axiom
annotated source: stem solidness
annotated property: has_related_synonym
annotated target: STMSOL
database_cross_reference: IWIS_TRAITID:1415

stem thickness
type: Class
subclass of: morphological trait
definition: Measurement of stem thickness in mm (millimeter).
database_cross_reference: IWIS_TRAITID:1414
database_cross_reference: TO:0000339
has_obo_namespace: wheat_trait
has_related_synonym: STMTHK
id: CO_321:0000062

Axiom
annotated source: stem thickness
annotated property: definition
annotated target: Measurement of stem thickness in mm (millimeter).
database_cross_reference: CO:rs

Axiom
annotated source: stem thickness
annotated property: has_related_synonym
annotated target: STMTHK
database_cross_reference: IWIS_TRAITID:1414

stomatal resistance
type: Class
subclass of: physiological trait
definition: Resistance to diffusion of water vapor through a plants stomata.
database_cross_reference: CO:0000523
database_cross_reference: IWIS_TRAITID:1373
has_obo_namespace: wheat_trait
has_related_synonym: STMRES
id: CO_321:0000063

Axiom
annotated source: stomatal resistance
annotated property: definition
annotated target: Resistance to diffusion of water vapor through a plants stomata.
database_cross_reference: CO:rs

Axiom
annotated source: stomatal resistance
annotated property: has_related_synonym
annotated target: STMRES
database_cross_reference: IWIS_TRAITID:1373

cookie spread factor
type: Class
subclass of: quality trait
definition: The ratio between average height and width of 5 cookies.
database_cross_reference: IWIS_TRAITID:1142
has_obo_namespace: wheat_trait
has_related_synonym: SPREAD
id: CO_321:0000064

Axiom
annotated source: cookie spread factor
annotated property: definition
annotated target: The ratio between average height and width of 5 cookies.
database_cross_reference: CIMMYT:jp
database_cross_reference: CO:rs

Axiom
annotated source: cookie spread factor
annotated property: has_related_synonym
annotated target: SPREAD
database_cross_reference: IWIS_TRAITID:1142

crumb structure
type: Class
subclass of: quality trait
definition: Measurement of the cellular structure of wheat bread crumb whether poor/fair/good/very good.
database_cross_reference: IWIS_TRAITID:1138
has_obo_namespace: wheat_trait
has_related_synonym: CRMSTR
id: CO_321:0000065

Axiom
annotated source: crumb structure
annotated property: definition
annotated target: Measurement of the cellular structure of wheat bread crumb whether poor/fair/good/very good.
database_cross_reference: CIMMYT:jp
database_cross_reference: CO:rs

Axiom
annotated source: crumb structure
annotated property: has_related_synonym
annotated target: CRMSTR
database_cross_reference: IWIS_TRAITID:1138

flour falling number
type: Class
subclass of: quality trait
definition: The falling number is defined as the time in seconds required stirring and allowing stirrer to fall a measured distance through a hot aqueous flour or meal gel undergoing liquefaction due to a-Amylase activity.
database_cross_reference: IWIS_TRAITID:1383
has_obo_namespace: wheat_trait
has_related_synonym: FLRFNO
id: CO_321:0000066

Axiom
annotated source: flour falling number
annotated property: definition
annotated target: The falling number is defined as the time in seconds required stirring and allowing stirrer to fall a measured distance through a hot aqueous flour or meal gel undergoing liquefaction due to a-Amylase activity.
database_cross_reference: http://www.qta.com

Axiom
annotated source: flour falling number
annotated property: has_related_synonym
annotated target: FLRFNO
database_cross_reference: IWIS_TRAITID:1383

flour protein content
type: Class
subclass of: quality trait
definition: Total protein percent (corrected to 14.0% moisture basis) in refined flour.
database_cross_reference: IWIS_TRAITID:1131
has_obo_namespace: wheat_trait
has_related_synonym: FLRPRO
id: CO_321:0000067

Axiom
annotated source: flour protein content
annotated property: definition
annotated target: Total protein percent (corrected to 14.0% moisture basis) in refined flour.
database_cross_reference: CIMMYT:jp
database_cross_reference: CO:rs

Axiom
annotated source: flour protein content
annotated property: has_related_synonym
annotated target: FLRPRO
database_cross_reference: IWIS_TRAITID:1131

flour yield
type: Class
subclass of: quality trait
definition: Percentage of flour recovered during milling.
database_cross_reference: IWIS_TRAITID:1132
has_obo_namespace: wheat_trait
has_related_synonym: FLRYLD
id: CO_321:0000068

Axiom
annotated source: flour yield
annotated property: definition
annotated target: Percentage of flour recovered during milling.
database_cross_reference: CIMMYT:jp
database_cross_reference: CO:rs

Axiom
annotated source: flour yield
annotated property: has_related_synonym
annotated target: FLRYLD
database_cross_reference: IWIS_TRAITID:1132

gluten content
type: Class
subclass of: quality trait
definition: Percentage of wet gluten in flour.
has_obo_namespace: wheat_trait
id: CO_321:0000069

Axiom
annotated source: gluten content
annotated property: definition
annotated target: Percentage of wet gluten in flour.
database_cross_reference: CIMMYT:jp
database_cross_reference: CO:rs

gluten type
type: Class
subclass of: quality trait
definition: Determination of gluten type whether weak-tenacious/tenacious/weak/medium strong/Strong/Overly strong.
database_cross_reference: IWIS_TRAITID:1125
has_obo_namespace: wheat_trait
has_related_synonym: GLUTYP
id: CO_321:0000070

Axiom
annotated source: gluten type
annotated property: definition
annotated target: Determination of gluten type whether weak-tenacious/tenacious/weak/medium strong/Strong/Overly strong.
database_cross_reference: CIMMYT:jp
database_cross_reference: CO:rs

Axiom
annotated source: gluten type
annotated property: has_related_synonym
annotated target: GLUTYP
database_cross_reference: IWIS_TRAITID:1125

grain falling number
type: Class
subclass of: quality trait
definition: Indication of the amount of sprout damage that has occurred within a wheat sample. Falling number value of 350 seconds or longer indicates a low enzyme activity and very sound wheat quality. As the amount of enzyme activity increases, the falling number decreases. Values below 200 seconds indicate high levels of enzyme activity.
database_cross_reference: IWIS_TRAITID:1139
has_obo_namespace: wheat_trait
has_related_synonym: <new synonym>
id: CO_321:0000071

Axiom
annotated source: grain falling number
annotated property: definition
annotated target: Indication of the amount of sprout damage that has occurred within a wheat sample. Falling number value of 350 seconds or longer indicates a low enzyme activity and very sound wheat quality. As the amount of enzyme activity increases, the falling number decreases. Values below 200 seconds indicate high levels of enzyme activity.
database_cross_reference: CO:rs

Axiom
annotated source: grain falling number
annotated property: has_related_synonym
annotated target: <new synonym>
database_cross_reference: IWIS_TRAITID:1139

grain hardness
type: Class
subclass of: quality trait
definition: Determination of grain quality whether very soft/medium soft/medium hard/ hard/very hard.
database_cross_reference: IWIS_TRAITID:1134
has_obo_namespace: wheat_trait
has_related_synonym: GRNHRD
id: CO_321:0000072

Axiom
annotated source: grain hardness
annotated property: definition
annotated target: Determination of grain quality whether very soft/medium soft/medium hard/ hard/very hard.
database_cross_reference: CIMMYT:jp
database_cross_reference: CO:rs

Axiom
annotated source: grain hardness
annotated property: has_related_synonym
annotated target: GRNHRD
database_cross_reference: IWIS_TRAITID:1134

grain protein content
type: Class
subclass of: quality trait
definition: It is determined in percentage of protein (corrected to 12.5% moisture basis) in the whole wheat grain samples.
database_cross_reference: IWIS_TRAITID:1130
has_obo_namespace: wheat_trait
has_related_synonym: GRNPRO
id: CO_321:0000073

Axiom
annotated source: grain protein content
annotated property: definition
annotated target: It is determined in percentage of protein (corrected to 12.5% moisture basis) in the whole wheat grain samples.
database_cross_reference: CO:rs

Axiom
annotated source: grain protein content
annotated property: has_related_synonym
annotated target: GRNPRO
database_cross_reference: IWIS_TRAITID:1130

semolina protein content
type: Class
subclass of: quality trait
definition: Protein content in durum wheat semolina.
database_cross_reference: IWIS_TRAITID:1141
has_obo_namespace: wheat_trait
has_related_synonym: <new synonym>
id: CO_321:0000074

Axiom
annotated source: semolina protein content
annotated property: definition
annotated target: Protein content in durum wheat semolina.
database_cross_reference: CO:rs

Axiom
annotated source: semolina protein content
annotated property: has_related_synonym
annotated target: <new synonym>
database_cross_reference: IWIS_TRAITID:1141

semolina yellow color value
type: Class
subclass of: quality trait
definition: Measurement of flour/semolina yellow color with the Minolta chromameter using the color scale b.
has_obo_namespace: wheat_trait
has_related_synonym: yellow pigment
id: CO_321:0000075

Axiom
annotated source: semolina yellow color value
annotated property: definition
annotated target: Measurement of flour/semolina yellow color with the Minolta chromameter using the color scale b.
database_cross_reference: CIMMYT:jp
database_cross_reference: CO:rs

abiotic stress trait
type: Class
subclass of: stress trait
has_obo_namespace: wheat_trait
id: CO_321:0000076

biotic stress trait
type: Class
subclass of: stress trait
has_obo_namespace: wheat_trait
id: CO_321:0000077

acidic soil tolerance
type: Class
subclass of: abiotic stress trait
definition: The trait is assessed for sensitivity to acid soil.
database_cross_reference: IWIS_TRAITID:1159
has_obo_namespace: wheat_trait
has_related_synonym: ACDTOL
id: CO_321:0000078

Axiom
annotated source: acidic soil tolerance
annotated property: definition
annotated target: The trait is assessed for sensitivity to acid soil.
database_cross_reference: CO:rs

Axiom
annotated source: acidic soil tolerance
annotated property: has_related_synonym
annotated target: ACDTOL
database_cross_reference: IWIS_TRAITID:1159

aluminum tolerance
type: Class
subclass of: abiotic stress trait
definition: The trait is assessed for sensitivity to aluminium.
database_cross_reference: IWIS_TRAITID:1160
has_obo_namespace: wheat_trait
has_related_synonym: ALUTOL
id: CO_321:0000079

Axiom
annotated source: aluminum tolerance
annotated property: definition
annotated target: The trait is assessed for sensitivity to aluminium.
database_cross_reference: CO:rs

Axiom
annotated source: aluminum tolerance
annotated property: has_related_synonym
annotated target: ALUTOL
database_cross_reference: IWIS_TRAITID:1160

cold tolerance
type: Class
subclass of: abiotic stress trait
definition: Observation of growth at temperatures lower than the optimum temperature.
database_cross_reference: IWIS_TRAITID:1165
database_cross_reference: TO:0000303
has_obo_namespace: wheat_trait
has_related_synonym: CLDTOL
has_related_synonym: CTOL
id: CO_321:0000080

Axiom
annotated source: cold tolerance
annotated property: definition
annotated target: Observation of growth at temperatures lower than the optimum temperature.
database_cross_reference: ISBN:9706480773

Axiom
annotated source: cold tolerance
annotated property: has_related_synonym
annotated target: CLDTOL
database_cross_reference: IWIS_TRAITID:1165

sprouting tolerance
type: Class
subclass of: abiotic stress trait
definition: The trait is assessed for the grain embryo dormancy.
database_cross_reference: IWIS_TRAITID:1168
has_obo_namespace: wheat_trait
has_related_synonym: SPROUT
id: CO_321:0000081

Axiom
annotated source: sprouting tolerance
annotated property: definition
annotated target: The trait is assessed for the grain embryo dormancy.
database_cross_reference: ISBN:9706480773

Axiom
annotated source: sprouting tolerance
annotated property: has_related_synonym
annotated target: SPROUT
database_cross_reference: IWIS_TRAITID:1168

alternaria leaf blight
type: Class
subclass of: fungal disease
definition: The trait is scored for the plant response to the agent Alternaria triticina causing alternaria leaf blight.
database_cross_reference: IWIS_TRAITID:1111
has_obo_namespace: wheat_trait
has_related_synonym: ATRIT
id: CO_321:0000082

Axiom
annotated source: alternaria leaf blight
annotated property: definition
annotated target: The trait is scored for the plant response to the agent Alternaria triticina causing alternaria leaf blight.
database_cross_reference: CO:rs

Axiom
annotated source: alternaria leaf blight
annotated property: has_related_synonym
annotated target: ATRIT
database_cross_reference: IWIS_TRAITID:1111

animal damage
type: Class
subclass of: biotic stress trait
definition: The trait is scored for the plant damages caused by various animals.
has_obo_namespace: wheat_trait
has_related_synonym: pest resistance
id: CO_321:0000083

Axiom
annotated source: animal damage
annotated property: definition
annotated target: The trait is scored for the plant damages caused by various animals.
database_cross_reference: CO:rs

Axiom
annotated source: animal damage
annotated property: has_related_synonym
annotated target: pest resistance
database_cross_reference: TO:0000054

ant damage
type: Class
subclass of: insect damage
definition: The trait is scored for the plant damage caused by ants.
database_cross_reference: IWIS_TRAITID:1034
has_obo_namespace: wheat_trait
has_related_synonym: DMGANT
id: CO_321:0000084

Axiom
annotated source: ant damage
annotated property: definition
annotated target: The trait is scored for the plant damage caused by ants.
database_cross_reference: CO:rs

Axiom
annotated source: ant damage
annotated property: has_related_synonym
annotated target: DMGANT
database_cross_reference: IWIS_TRAITID:1034

aphid damage
type: Class
subclass of: insect damage
definition: The trait is scored for the damage caused by various species of aphids.
database_cross_reference: IWIS_TRAITID:1026
has_obo_namespace: wheat_trait
has_related_synonym: DMGAPH
id: CO_321:0000085

Axiom
annotated source: aphid damage
annotated property: definition
annotated target: The trait is scored for the damage caused by various species of aphids.
database_cross_reference: CO:rs

Axiom
annotated source: aphid damage
annotated property: has_related_synonym
annotated target: DMGAPH
database_cross_reference: IWIS_TRAITID:1026

armyworm damage
type: Class
subclass of: insect damage
definition: The trait is scored for the plant damage caused by armyworm.
database_cross_reference: IWIS_TRAITID:1023
has_obo_namespace: wheat_trait
has_related_synonym: AWRRS
has_related_synonym: DMGARM
id: CO_321:0000086

Axiom
annotated source: armyworm damage
annotated property: definition
annotated target: The trait is scored for the plant damage caused by armyworm.
database_cross_reference: TO:0000273

Axiom
annotated source: armyworm damage
annotated property: has_related_synonym
annotated target: AWRRS
database_cross_reference: IWIS_TRAITID:1023

Axiom
annotated source: armyworm damage
annotated property: has_related_synonym
annotated target: DMGARM
database_cross_reference: IWIS_TRAITID:1023

bird damage
type: Class
subclass of: animal damage
definition: The trait is scored for the plant damage caused by birds.
database_cross_reference: IWIS_TRAITID:1021
database_cross_reference: TO:0000260
has_obo_namespace: wheat_trait
has_related_synonym: BD
has_related_synonym: DMGBIR
id: CO_321:0000087

Axiom
annotated source: bird damage
annotated property: definition
annotated target: The trait is scored for the plant damage caused by birds.
database_cross_reference: CO:rs

Axiom
annotated source: bird damage
annotated property: has_related_synonym
annotated target: BD
database_cross_reference: TO:0000260

Axiom
annotated source: bird damage
annotated property: has_related_synonym
annotated target: DMGBIR
database_cross_reference: IWIS_TRAITID:1021

hessian fly damage
type: Class
subclass of: insect damage
definition: The trait is scored for the plant damage caused by hessian fly, Maytiola destructor.
database_cross_reference: IWIS_TRAITID:1107
has_obo_namespace: wheat_trait
has_related_synonym: MDEST
id: CO_321:0000088

Axiom
annotated source: hessian fly damage
annotated property: definition
annotated target: The trait is scored for the plant damage caused by hessian fly, Maytiola destructor.
database_cross_reference: CO:rs

Axiom
annotated source: hessian fly damage
annotated property: has_related_synonym
annotated target: MDEST
database_cross_reference: IWIS_TRAITID:1107

insect damage
type: Class
subclass of: biotic stress trait
definition: The trait is scored for the plant damage caused by any insects.
database_cross_reference: IWIS_TRAITID:1019
database_cross_reference: IWIS_TRAITID:1171
has_obo_namespace: wheat_trait
has_related_synonym: DMGINS
id: CO_321:0000089

Axiom
annotated source: insect damage
annotated property: definition
annotated target: The trait is scored for the plant damage caused by any insects.
database_cross_reference: TO:0000261

Axiom
annotated source: insect damage
annotated property: has_related_synonym
annotated target: DMGINS
database_cross_reference: IWIS_TRAITID:1019

rodent damage
type: Class
subclass of: animal damage
definition: The trait is scored for the plant damage caused by rodent.
database_cross_reference: IWIS_TRAITID:1028
database_cross_reference: TO:0000117
has_exact_synonym: rat damage
has_obo_namespace: wheat_trait
has_related_synonym: DMGROD
id: CO_321:0000090

Axiom
annotated source: rodent damage
annotated property: definition
annotated target: The trait is scored for the plant damage caused by rodent.
database_cross_reference: CO:rs

Axiom
annotated source: rodent damage
annotated property: has_related_synonym
annotated target: DMGROD
database_cross_reference: IWIS_TRAITID:1028

russian wheat aphid damage
type: Class
subclass of: insect damage
definition: The trait is scored for the plant damage caused by russian wheat aphid, Diuraphis noxis.
database_cross_reference: IWIS_TRAITID:1106
has_obo_namespace: wheat_trait
has_related_synonym: DNOXI
id: CO_321:0000091

Axiom
annotated source: russian wheat aphid damage
annotated property: definition
annotated target: The trait is scored for the plant damage caused by russian wheat aphid, Diuraphis noxis.
database_cross_reference: CO:rs

Axiom
annotated source: russian wheat aphid damage
annotated property: has_related_synonym
annotated target: DNOXI
database_cross_reference: IWIS_TRAITID:1106

sawfly damage
type: Class
subclass of: insect damage
definition: The trait is scored for the plant damage caused by sawfly, Cephus cinctus.
database_cross_reference: IWIS_TRAITID:1108
has_obo_namespace: wheat_trait
has_related_synonym: CPYGM
id: CO_321:0000092

Axiom
annotated source: sawfly damage
annotated property: definition
annotated target: The trait is scored for the plant damage caused by sawfly, Cephus cinctus.
database_cross_reference: CO:rs

Axiom
annotated source: sawfly damage
annotated property: has_related_synonym
annotated target: CPYGM
database_cross_reference: IWIS_TRAITID:1108

snail damage
type: Class
subclass of: insect damage
definition: The trait is scored for the plant damage caused by snails.
database_cross_reference: IWIS_TRAITID:1027
has_obo_namespace: wheat_trait
has_related_synonym: DMGSNA
id: CO_321:0000093

Axiom
annotated source: snail damage
annotated property: definition
annotated target: The trait is scored for the plant damage caused by snails.
database_cross_reference: CO:rs

Axiom
annotated source: snail damage
annotated property: has_related_synonym
annotated target: DMGSNA
database_cross_reference: IWIS_TRAITID:1027

suni pest damage
type: Class
subclass of: insect damage
definition: The trait is scored for the plant damage caused by suni pest.
database_cross_reference: IWIS_TRAITID:1029
has_obo_namespace: wheat_trait
has_related_synonym: DMGSUP
id: CO_321:0000094

Axiom
annotated source: suni pest damage
annotated property: definition
annotated target: The trait is scored for the plant damage caused by suni pest.
database_cross_reference: CO:rs

Axiom
annotated source: suni pest damage
annotated property: has_related_synonym
annotated target: DMGSUP
database_cross_reference: IWIS_TRAITID:1029

stripe mosaic
type: Class
subclass of: viral disease
definition: The trait is scored for the response to the barley stripe mosaic disease caused by barley stripe mosaic virus.
database_cross_reference: IWIS_TRAITID:1100
has_obo_namespace: wheat_trait
has_related_synonym: BSM.V
id: CO_321:0000095

Axiom
annotated source: stripe mosaic
annotated property: definition
annotated target: The trait is scored for the response to the barley stripe mosaic disease caused by barley stripe mosaic virus.
database_cross_reference: CO:rs

Axiom
annotated source: stripe mosaic
annotated property: has_related_synonym
annotated target: BSM.V
database_cross_reference: IWIS_TRAITID:1100

yellow dwarf
type: Class
subclass of: viral disease
definition: The trait is scored for the plant response to the agent wheat yellow dwarf virus causing wheat yellow dwarf disease.
database_cross_reference: IWIS_TRAITID:1099
has_obo_namespace: wheat_trait
has_related_synonym: BYD.V
has_related_synonym: barley yellow dwarf resistance
id: CO_321:0000096

Axiom
annotated source: yellow dwarf
annotated property: definition
annotated target: The trait is scored for the plant response to the agent wheat yellow dwarf virus causing wheat yellow dwarf disease.
database_cross_reference: CO:rs

Axiom
annotated source: yellow dwarf
annotated property: has_related_synonym
annotated target: BYD.V
database_cross_reference: IWIS_TRAITID:1099

black point
type: Class
subclass of: fungal disease
definition: The trait is scored for the plant response to the agents Alternaria, Helminthosporium and Fusarium spp. causing black point disease.
database_cross_reference: IWIS_TRAITID:1098
has_obo_namespace: wheat_trait
has_related_synonym: BLKPT
id: CO_321:0000097

Axiom
annotated source: black point
annotated property: definition
annotated target: The trait is scored for the plant response to the agents Alternaria, Helminthosporium and Fusarium spp. causing black point disease.
database_cross_reference: CO:rs

Axiom
annotated source: black point
annotated property: has_related_synonym
annotated target: BLKPT
database_cross_reference: IWIS_TRAITID:1098

bunt
type: Class
subclass of: fungal disease
definition: The trait is scored for the plant response to the agent Tilletia species causing bunt disease.
has_obo_namespace: wheat_trait
has_related_synonym: TILSP
has_related_synonym: stinking bunt
id: CO_321:0000098

Axiom
annotated source: bunt
annotated property: definition
annotated target: The trait is scored for the plant response to the agent Tilletia species causing bunt disease.
database_cross_reference: CO:rs

Axiom
annotated source: bunt
annotated property: has_related_synonym
annotated target: TILSP
database_cross_reference: IWIS_TRAITID:1094

Axiom
annotated source: bunt
annotated property: has_related_synonym
annotated target: stinking bunt
database_cross_reference: IWIS_TRAITID:1094

tilletia laevis common bunt
type: Class
subclass of: bunt
definition: The trait is scored for the plant response to the agent Tilletia laevis causing common bunt disease.
database_cross_reference: IWIS_TRAITID:1270
has_obo_namespace: wheat_trait
has_related_synonym: TLAEV
id: CO_321:0000099

Axiom
annotated source: tilletia laevis common bunt
annotated property: definition
annotated target: The trait is scored for the plant response to the agent Tilletia laevis causing common bunt disease.
database_cross_reference: CO:rs

Axiom
annotated source: tilletia laevis common bunt
annotated property: has_related_synonym
annotated target: TLAEV
database_cross_reference: IWIS_TRAITID:1270

tilletia tritici common bunt
type: Class
subclass of: bunt
definition: The trait is scored for the plant response to the agent Tilletia tritici causing common bunt disease.
database_cross_reference: IWIS_TRAITID:1271
has_obo_namespace: wheat_trait
has_related_synonym: TTRIT
id: CO_321:0000100

Axiom
annotated source: tilletia tritici common bunt
annotated property: definition
annotated target: The trait is scored for the plant response to the agent Tilletia tritici causing common bunt disease.
database_cross_reference: CO:rs

Axiom
annotated source: tilletia tritici common bunt
annotated property: has_related_synonym
annotated target: TTRIT
database_cross_reference: IWIS_TRAITID:1271

dwarf bunt
type: Class
subclass of: bunt
definition: The trait is scored for the plant response to the agent Tilletia controversa causing dwarf bunt disease.
database_cross_reference: IWIS_TRAITID:1095
has_obo_namespace: wheat_trait
has_related_synonym: TCONT
id: CO_321:0000101

Axiom
annotated source: dwarf bunt
annotated property: definition
annotated target: The trait is scored for the plant response to the agent Tilletia controversa causing dwarf bunt disease.
database_cross_reference: CO:rs

Axiom
annotated source: dwarf bunt
annotated property: has_related_synonym
annotated target: TCONT
database_cross_reference: IWIS_TRAITID:1095

eyespot
type: Class
subclass of: fungal disease
definition: The trait is scored for the plant response to the agents necrotrophic fungus Tapesia yallundae (Pseudocercosporella herpotrichoide W-type) and Tapesia acuformis (Pseudocercosporella herpotrichoides R-type)causing eye spot disease. Symptoms: The eye shape elliptical lesions forms on lower base of stem and lower leaf sheath. The eyespots are straw yellow in color from the middle and are surrounded by the greenish brown to dark brown rings.
database_cross_reference: IWIS_TRAITID:1116
has_obo_namespace: wheat_trait
has_related_synonym: PHERP
has_related_synonym: strawbreaker
id: CO_321:0000102

Axiom
annotated source: eyespot
annotated property: definition
annotated target: The trait is scored for the plant response to the agents necrotrophic fungus Tapesia yallundae (Pseudocercosporella herpotrichoide W-type) and Tapesia acuformis (Pseudocercosporella herpotrichoides R-type)causing eye spot disease. Symptoms: The eye shape elliptical lesions forms on lower base of stem and lower leaf sheath. The eyespots are straw yellow in color from the middle and are surrounded by the greenish brown to dark brown rings.
database_cross_reference: CO:rs
database_cross_reference: http://en.wikipedia.org/wiki/Eyespot_(wheat)

Axiom
annotated source: eyespot
annotated property: has_related_synonym
annotated target: PHERP
database_cross_reference: IWIS_TRAITID:1116

flag smut
type: Class
subclass of: smut
definition: The trait is scored for the plant response to the agent Urocystis agropyri causing flag smut disease.
database_cross_reference: IWIS_TRAITID:1096
has_obo_namespace: wheat_trait
id: CO_321:0000103

Axiom
annotated source: flag smut
annotated property: definition
annotated target: The trait is scored for the plant response to the agent Urocystis agropyri causing flag smut disease.
database_cross_reference: CO:rs

scab
type: Class
subclass of: fungal disease
definition: The trait is scored for the plant response to the agent Fusarium spp. causing wheat scab disease. Symptoms: Infected florets become slightly darkened and oily in appearance.
database_cross_reference: IWIS_TRAITID:1097
has_obo_namespace: wheat_trait
has_related_synonym: FSCABG
has_related_synonym: fusarium head blight
has_related_synonym: scab grain resistance
id: CO_321:0000104

Axiom
annotated source: scab
annotated property: definition
annotated target: The trait is scored for the plant response to the agent Fusarium spp. causing wheat scab disease. Symptoms: Infected florets become slightly darkened and oily in appearance.
database_cross_reference: CO:rs

Axiom
annotated source: scab
annotated property: has_related_synonym
annotated target: FSCABG
database_cross_reference: IWIS_TRAITID:1097

fusarium scab spike
type: Class
subclass of: scab
definition: The trait is scored for the plant response to the agent Calonectria nivalis (Fusarium nivale)causing scab disease in spike.
database_cross_reference: IWIS_TRAITID:1089
has_obo_namespace: wheat_trait
has_related_synonym: FSCABS
id: CO_321:0000105

Axiom
annotated source: fusarium scab spike
annotated property: definition
annotated target: The trait is scored for the plant response to the agent Calonectria nivalis (Fusarium nivale)causing scab disease in spike.
database_cross_reference: CO:rs

Axiom
annotated source: fusarium scab spike
annotated property: has_related_synonym
annotated target: FSCABS
database_cross_reference: IWIS_TRAITID:1089

karnal bunt
type: Class
subclass of: bunt
definition: The trait is scored for the plant response to the agent Tilletia indica (syn. Neovossia indica) causing karnal bunt disease.
database_cross_reference: IWIS_TRAITID:1091
has_obo_namespace: wheat_trait
has_related_synonym: TINDI
id: CO_321:0000106

Axiom
annotated source: karnal bunt
annotated property: definition
annotated target: The trait is scored for the plant response to the agent Tilletia indica (syn. Neovossia indica) causing karnal bunt disease.
database_cross_reference: CO:rs

Axiom
annotated source: karnal bunt
annotated property: has_related_synonym
annotated target: TINDI
database_cross_reference: IWIS_TRAITID:1091

leaf rust
type: Class
subclass of: rust
definition: The trait is scored for the plant response to the agent Puccinia recondita causing leaf rust disease.
database_cross_reference: IWIS_TRAITID:1073
has_obo_namespace: wheat_trait
has_related_synonym: PRECO
id: CO_321:0000107

Axiom
annotated source: leaf rust
annotated property: definition
annotated target: The trait is scored for the plant response to the agent Puccinia recondita causing leaf rust disease.
database_cross_reference: CO:rs

Axiom
annotated source: leaf rust
annotated property: has_related_synonym
annotated target: PRECO
database_cross_reference: IWIS_TRAITID:1073

loose smut
type: Class
subclass of: smut
definition: The trait is scored for the plant response to the agent Ustilago tritici causing loose smut disease.
database_cross_reference: IWIS_TRAITID:1093
has_obo_namespace: wheat_trait
has_related_synonym: UTRIT
id: CO_321:0000108

Axiom
annotated source: loose smut
annotated property: definition
annotated target: The trait is scored for the plant response to the agent Ustilago tritici causing loose smut disease.
database_cross_reference: CO:rs

Axiom
annotated source: loose smut
annotated property: has_related_synonym
annotated target: UTRIT
database_cross_reference: IWIS_TRAITID:1093

nematode damage
type: Class
subclass of: biotic stress trait
definition: The trait is scored for the plant damage caused by nematodes.
database_cross_reference: IWIS_TRAITID:1033
database_cross_reference: TO:0000384
has_obo_namespace: wheat_trait
has_related_synonym: DMGNEM
id: CO_321:0000109

Axiom
annotated source: nematode damage
annotated property: definition
annotated target: The trait is scored for the plant damage caused by nematodes.
database_cross_reference: CO:rs

Axiom
annotated source: nematode damage
annotated property: has_related_synonym
annotated target: DMGNEM
database_cross_reference: IWIS_TRAITID:1033

seed-gall nematode damage
type: Class
subclass of: nematode damage
definition: The trait is scored for the wheat seed-gall nematode damage caused by Anguina tritici.
database_cross_reference: IWIS_TRAITID:1102
has_obo_namespace: wheat_trait
id: CO_321:0000110

Axiom
annotated source: seed-gall nematode damage
annotated property: definition
annotated target: The trait is scored for the wheat seed-gall nematode damage caused by Anguina tritici.
database_cross_reference: CO:rs

cyst nematode damage
type: Class
subclass of: nematode damage
definition: The trait is scored for the wheat cyst nematode damage caused by cyst nematode, Heterodera avenae.
database_cross_reference: IWIS_TRAITID:1103
has_obo_namespace: wheat_trait
has_related_synonym: HAVEN
has_related_synonym: cyst nematode
id: CO_321:0000111

Axiom
annotated source: cyst nematode damage
annotated property: definition
annotated target: The trait is scored for the wheat cyst nematode damage caused by cyst nematode, Heterodera avenae.
database_cross_reference: CO:rs

Axiom
annotated source: cyst nematode damage
annotated property: has_related_synonym
annotated target: HAVEN
database_cross_reference: IWIS_TRAITID:1103

Pratylenchus neglectus root-lesion nematode damage
type: Class
subclass of: root-lesion nematode damage
definition: The trait is scored for the plant damage caused by root-lesion nematode, Pratylenchus neglectus.
database_cross_reference: IWIS_TRAITID:1105
has_obo_namespace: wheat_trait
has_related_synonym: PNEGL
has_related_synonym: lesion nematode
id: CO_321:0000112

Axiom
annotated source: Pratylenchus neglectus root-lesion nematode damage
annotated property: definition
annotated target: The trait is scored for the plant damage caused by root-lesion nematode, Pratylenchus neglectus.
database_cross_reference: CO:rs

Axiom
annotated source: Pratylenchus neglectus root-lesion nematode damage
annotated property: has_related_synonym
annotated target: PNEGL
database_cross_reference: IWIS_TRAITID:1105

Pratylenchus thornei root-lesion nematode damage
type: Class
subclass of: root-lesion nematode damage
definition: The trait is scored for the plant damage caused by root-lesion nematode, Pratylenchus thornei.
database_cross_reference: IWIS_TRAITID:1104
has_obo_namespace: wheat_trait
has_related_synonym: PTHOR
has_related_synonym: lesion nematode
id: CO_321:0000113

Axiom
annotated source: Pratylenchus thornei root-lesion nematode damage
annotated property: definition
annotated target: The trait is scored for the plant damage caused by root-lesion nematode, Pratylenchus thornei.
database_cross_reference: CO:rs

Axiom
annotated source: Pratylenchus thornei root-lesion nematode damage
annotated property: has_related_synonym
annotated target: PTHOR
database_cross_reference: IWIS_TRAITID:1104

Axiom
annotated source: Pratylenchus thornei root-lesion nematode damage
annotated property: has_related_synonym
annotated target: lesion nematode
database_cross_reference: http://www.apsnet.org/online/common/names/wheat.asp

powdery mildew
type: Class
subclass of: fungal disease
definition: The trait is scored for the plant response to the agent Blumeria graminis (Erysiphe graminis) f. sp. tritici wheat powdery mildew disease.
database_cross_reference: IWIS_TRAITID:1081
has_obo_namespace: wheat_trait
has_related_synonym: EGRAM
id: CO_321:0000114

Axiom
annotated source: powdery mildew
annotated property: definition
annotated target: The trait is scored for the plant response to the agent Blumeria graminis (Erysiphe graminis) f. sp. tritici wheat powdery mildew disease.
database_cross_reference: CO:rs

Axiom
annotated source: powdery mildew
annotated property: has_related_synonym
annotated target: EGRAM
database_cross_reference: IWIS_TRAITID:1081

southern blight
type: Class
subclass of: fungal disease
definition: The trait is scored for the plant response to the agent Corticum rolfsii (Sclerotium rolfsii) causing wheat southern blight.
database_cross_reference: IWIS_TRAITID:1115
has_obo_namespace: wheat_trait
has_related_synonym: SROLF
has_related_synonym: sclerotium blight
has_related_synonym: southern blight
id: CO_321:0000115

Axiom
annotated source: southern blight
annotated property: definition
annotated target: The trait is scored for the plant response to the agent Corticum rolfsii (Sclerotium rolfsii) causing wheat southern blight.
database_cross_reference: CO:rs

Axiom
annotated source: southern blight
annotated property: has_related_synonym
annotated target: SROLF
database_cross_reference: IWIS_TRAITID:1115

spot blotch
type: Class
subclass of: blotch
definition: The trait is scored for the plant response to the agent Cochliobolus sativus (Helminthosporium sativum)wheat spot blotch.
has_obo_namespace: wheat_trait
has_related_synonym: SNODO
has_related_synonym: spot blotch
id: CO_321:0000116

Axiom
annotated source: spot blotch
annotated property: definition
annotated target: The trait is scored for the plant response to the agent Cochliobolus sativus (Helminthosporium sativum)wheat spot blotch.
database_cross_reference: CO:rs

septoria tritici blotch
type: Class
subclass of: septoria blotch
definition: The trait is scored for the plant response to the agent Mycosphaerella graminicola (Septoria tritici)septoria tritici causing blotch disease. Symptoms: The lesions are linear and restricted laterally.
database_cross_reference: IWIS_TRAITID:1075
has_obo_namespace: wheat_trait
has_related_synonym: STRIT
id: CO_321:0000117

Axiom
annotated source: septoria tritici blotch
annotated property: definition
annotated target: The trait is scored for the plant response to the agent Mycosphaerella graminicola (Septoria tritici)septoria tritici causing blotch disease. Symptoms: The lesions are linear and restricted laterally.
database_cross_reference: CO:rs

Axiom
annotated source: septoria tritici blotch
annotated property: has_related_synonym
annotated target: STRIT
database_cross_reference: IWIS_TRAITID:1075

stem rust
type: Class
subclass of: rust
definition: The trait is scored for the plant response to the agent Puccinia graminis f.sp. tritici causing stem rust disease.
database_cross_reference: IWIS_TRAITID:1072
has_obo_namespace: wheat_trait
has_related_synonym: PGRAM
id: CO_321:0000118

Axiom
annotated source: stem rust
annotated property: definition
annotated target: The trait is scored for the plant response to the agent Puccinia graminis f.sp. tritici causing stem rust disease.
database_cross_reference: CO:rs

Axiom
annotated source: stem rust
annotated property: has_related_synonym
annotated target: PGRAM
database_cross_reference: IWIS_TRAITID:1072

take-all
type: Class
subclass of: fungal disease
definition: The trait is scored for the plant response to the agent Gaeumannomyces graminis var. tritici (Ggt)causing wheat take-all disease.
has_obo_namespace: wheat_trait
id: CO_321:0000119

Axiom
annotated source: take-all
annotated property: definition
annotated target: The trait is scored for the plant response to the agent Gaeumannomyces graminis var. tritici (Ggt)causing wheat take-all disease.
database_cross_reference: CO:rs

bacterial leaf streak
type: Class
subclass of: bacterial disease
definition: The trait is scored for the plant response to the agent Xanthomonas translucens causing bacterial leaf streak disease.
database_cross_reference: IWIS_TRAITID:1080
has_obo_namespace: wheat_trait
has_related_synonym: XCUND
has_related_synonym: black chaff
has_related_synonym: xanthomonas streak
id: CO_321:0000120

Axiom
annotated source: bacterial leaf streak
annotated property: definition
annotated target: The trait is scored for the plant response to the agent Xanthomonas translucens causing bacterial leaf streak disease.
database_cross_reference: CO:rs

Axiom
annotated source: bacterial leaf streak
annotated property: has_related_synonym
annotated target: XCUND
database_cross_reference: IWIS_TRAITID:1080

Axiom
annotated source: bacterial leaf streak
annotated property: has_related_synonym
annotated target: black chaff
database_cross_reference: http://www.apsnet.org/online/common/names/wheat.asp

Axiom
annotated source: bacterial leaf streak
annotated property: has_related_synonym
annotated target: xanthomonas streak
database_cross_reference: http://www.apsnet.org/online/common/names/wheat.asp

days to flower
type: Class
subclass of: agronomic trait
definition: Counted as days from sowing to 50% of the plants in flower. However, when planting in dry soils in dryland areas it is counted from the first day of rainfall or irrigation which is sufficient for germination.
database_cross_reference: IWIS_TRAITID:1149
has_obo_namespace: wheat_trait
has_related_synonym: ANTH
has_related_synonym: Anthes
has_related_synonym: DAYSAN
has_related_synonym: anthesis
has_related_synonym: day to anthesis
id: CO_321:0000121

Axiom
annotated source: days to flower
annotated property: definition
annotated target: Counted as days from sowing to 50% of the plants in flower. However, when planting in dry soils in dryland areas it is counted from the first day of rainfall or irrigation which is sufficient for germination.
database_cross_reference: ISBN:9290431891

Axiom
annotated source: days to flower
annotated property: has_related_synonym
annotated target: DAYSAN
database_cross_reference: IWIS_TRAITID:1149

fungal disease
type: Class
subclass of: biotic stress trait
definition: The trait is scored for the plant response to the diseases caused by various fungi.
has_obo_namespace: wheat_trait
id: CO_321:0000122

Axiom
annotated source: fungal disease
annotated property: definition
annotated target: The trait is scored for the plant response to the diseases caused by various fungi.
database_cross_reference: CO:rs

harvest index
type: Class
subclass of: morphological trait
definition: The ratio of grain weight to total plant weight.
database_cross_reference: IWIS_TRAITID:1161
database_cross_reference: TO:0000128
has_obo_namespace: wheat_trait
has_related_synonym: HARIDX
id: CO_321:0000123

Axiom
annotated source: harvest index
annotated property: definition
annotated target: The ratio of grain weight to total plant weight.
database_cross_reference: CO:rs

Axiom
annotated source: harvest index
annotated property: has_related_synonym
annotated target: HARIDX
database_cross_reference: IWIS_TRAITID:1161

bread loaf volume
type: Class
subclass of: quality trait
definition: Measurement of baking quality of flour.
database_cross_reference: IWIS_TRAITID:1129
has_obo_namespace: wheat_trait
has_related_synonym: LOFVOL
id: CO_321:0000124

Axiom
annotated source: bread loaf volume
annotated property: definition
annotated target: Measurement of baking quality of flour.
database_cross_reference: CO:rs

Axiom
annotated source: bread loaf volume
annotated property: has_related_synonym
annotated target: LOFVOL
database_cross_reference: IWIS_TRAITID:1129

fusarium leaf blotch
type: Class
subclass of: blotch
definition: The trait is scored for the plant response to the agent Calonectria nivalis (Fusarium nivale)causing fusarium leaf blotch disease.
has_obo_namespace: wheat_trait
has_related_synonym: SNODON
has_related_synonym: snow mold
id: CO_321:0000125

Axiom
annotated source: fusarium leaf blotch
annotated property: definition
annotated target: The trait is scored for the plant response to the agent Calonectria nivalis (Fusarium nivale)causing fusarium leaf blotch disease.
database_cross_reference: CO:rs

hail damage
type: Class
subclass of: abiotic stress trait
definition: The trait is assessed in percentage for the plant damage caused by hail.
database_cross_reference: IWIS_TRAITID:1030
has_obo_namespace: wheat_trait
has_related_synonym: DMGHAI
id: CO_321:0000126

Axiom
annotated source: hail damage
annotated property: definition
annotated target: The trait is assessed in percentage for the plant damage caused by hail.
database_cross_reference: CO:rs

frost damage
type: Class
subclass of: abiotic stress trait
definition: The trait is assessed in percentage for the plant damage caused by frost.
database_cross_reference: IWIS_TRAITID:1031
has_obo_namespace: wheat_trait
has_related_synonym: DMGFRO
id: CO_321:0000127

Axiom
annotated source: frost damage
annotated property: definition
annotated target: The trait is assessed in percentage for the plant damage caused by frost.
database_cross_reference: CO:rs

waterlogging damage
type: Class
subclass of: abiotic stress trait
definition: The trait is assessed in percentage for the plant damage caused by waterlogging.
database_cross_reference: IWIS_TRAITID:1032
has_obo_namespace: wheat_trait
has_related_synonym: DMGH20
id: CO_321:0000128

Axiom
annotated source: waterlogging damage
annotated property: definition
annotated target: The trait is assessed in percentage for the plant damage caused by waterlogging.
database_cross_reference: CO:rs

stripe rust
type: Class
subclass of: rust
definition: The trait is scored for the plant response to the agent Puccinia striiformis f.sp. tritici causing stripe rust disease.
has_obo_namespace: wheat_trait
id: CO_321:0000129

Axiom
annotated source: stripe rust
annotated property: definition
annotated target: The trait is scored for the plant response to the agent Puccinia striiformis f.sp. tritici causing stripe rust disease.
database_cross_reference: CO:rs

stagonospora glume blotch
type: Class
subclass of: septoria blotch
definition: The trait is scored for the plant response to the agent Leptosphaeria nodorum (Stagonospora nodorum, Septoria nodorum)causing stagonospora glume blotch. Symptoms: The lesions are lighter brown and often lens-shaped with a darker brown center.
database_cross_reference: IWIS_TRAITID:1109
has_obo_namespace: wheat_trait
has_related_synonym: septoria nodorum blotch
id: CO_321:0000130

Axiom
annotated source: stagonospora glume blotch
annotated property: definition
annotated target: The trait is scored for the plant response to the agent Leptosphaeria nodorum (Stagonospora nodorum, Septoria nodorum)causing stagonospora glume blotch. Symptoms: The lesions are lighter brown and often lens-shaped with a darker brown center.
database_cross_reference: CO:rs

drought tolerance
type: Class
subclass of: abiotic stress trait
definition: Becoming tolerant to drought like conditions of minimal or no water content in the growth environment.
has_obo_namespace: wheat_trait
id: CO_321:0000131

Axiom
annotated source: drought tolerance
annotated property: definition
annotated target: Becoming tolerant to drought like conditions of minimal or no water content in the growth environment.
database_cross_reference: TO:0000276

salinity tolerance
type: Class
subclass of: abiotic stress trait
definition: Tolerance to the high salt content in the growth medium.
has_obo_namespace: wheat_trait
has_related_synonym: salt tolerance
id: CO_321:0000132

Axiom
annotated source: salinity tolerance
annotated property: definition
annotated target: Tolerance to the high salt content in the growth medium.
database_cross_reference: TO:0006001

rust
type: Class
subclass of: fungal disease
created by: RSHRESTHA
creation date: 2009-06-03T04:25:00Z
has_obo_namespace: wheat_trait
id: CO_321:0000133

blotch
type: Class
subclass of: fungal disease
created by: RSHRESTHA
creation date: 2009-06-03T04:29:17Z
has_obo_namespace: wheat_trait
id: CO_321:0000134

pyrenophora yellow leaf blotch
type: Class
subclass of: blotch
definition: The trait is scored for the plant response to the agent Pyrenophora trichostoma (Helminthhosporium tritici-repentis)causing pyrenophora yellow leaf blotch disease. Symptoms: The lesions appear as tan to brown flecks, which expand into large, irregular, oval- or lens-shaped tan blotches with a yellow or chlorotic margin.
created by: RSHRESTHA
creation date: 2009-06-04T11:57:34Z
has_obo_namespace: wheat_trait
has_related_synonym: tan spot
has_related_synonym: yellow leaf spot
id: CO_321:0000135

Axiom
annotated source: pyrenophora yellow leaf blotch
annotated property: definition
annotated target: The trait is scored for the plant response to the agent Pyrenophora trichostoma (Helminthhosporium tritici-repentis)causing pyrenophora yellow leaf blotch disease. Symptoms: The lesions appear as tan to brown flecks, which expand into large, irregular, oval- or lens-shaped tan blotches with a yellow or chlorotic margin.
database_cross_reference: CO:rs

smut
type: Class
subclass of: fungal disease
definition: The trait is scored for the plant response to the agent Ustilago spp. causing wheat smut disease.
created by: RSHRESTHA
creation date: 2009-06-04T02:22:40Z
has_obo_namespace: wheat_trait
id: CO_321:0000136

Axiom
annotated source: smut
annotated property: definition
annotated target: The trait is scored for the plant response to the agent Ustilago spp. causing wheat smut disease.
database_cross_reference: CO:rs

bacterial disease
type: Class
subclass of: biotic stress trait
definition: The trait is scored for the plan response to the diseases caused by various bacteria.
created by: RSHRESTHA
creation date: 2009-06-04T02:24:37Z
database_cross_reference: TO:0000315
has_obo_namespace: wheat_trait
id: CO_321:0000137

Axiom
annotated source: bacterial disease
annotated property: definition
annotated target: The trait is scored for the plan response to the diseases caused by various bacteria.
database_cross_reference: CO:rs

bacterial leaf blight
type: Class
subclass of: bacterial disease
definition: The trait is scored for the plant response to the agent Pseudomonas syringae pv. syringae causing wheat bacterial leaf blight disease. Symptoms: Small (less than 0.04 inches) water-soaked lesions expand and eventually coalesce. Initial lesions become necrotic and turn from gray-green to tan-white. Entire leaves may become necrotic, but heads and glumes are typically symptomless.
created by: RSHRESTHA
creation date: 2009-06-04T02:28:44Z
has_obo_namespace: wheat_trait
id: CO_321:0000138

Axiom
annotated source: bacterial leaf blight
annotated property: definition
annotated target: The trait is scored for the plant response to the agent Pseudomonas syringae pv. syringae causing wheat bacterial leaf blight disease. Symptoms: Small (less than 0.04 inches) water-soaked lesions expand and eventually coalesce. Initial lesions become necrotic and turn from gray-green to tan-white. Entire leaves may become necrotic, but heads and glumes are typically symptomless.
database_cross_reference: CO:rs

viral disease
type: Class
subclass of: biotic stress trait
definition: The trait is scored for the plant response to the diseases caused by various virus.
created by: RSHRESTHA
creation date: 2009-06-04T02:52:27Z
database_cross_reference: IWIS_TRAITID:1101
has_obo_namespace: wheat_trait
id: CO_321:0000139

Axiom
annotated source: viral disease
annotated property: definition
annotated target: The trait is scored for the plant response to the diseases caused by various virus.
database_cross_reference: CO:rs

physiological trait
type: Class
subclass of: CGIAR wheat trait ontology
created by: RSHRESTHA
creation date: 2009-06-04T04:51:05Z
has_obo_namespace: wheat_trait
id: CO_321:0000140

flag leaf area
type: Class
subclass of: physiological trait
definition: Measured directly, or estimated as length and breadth of flag leaf usually of mother shoot and multiply by 0.7 in square centimeter.
created by: RSHRESTHA
creation date: 2009-06-09T10:55:47Z
has_obo_namespace: wheat_trait
id: CO_321:0000141

Axiom
annotated source: flag leaf area
annotated property: definition
annotated target: Measured directly, or estimated as length and breadth of flag leaf usually of mother shoot and multiply by 0.7 in square centimeter.
database_cross_reference: CIMMYT:mr

stomatal size
type: Class
subclass of: physiological trait
definition: Measurement of stomata size in micrometers.
created by: RSHRESTHA
creation date: 2009-06-09T11:01:19Z
has_obo_namespace: wheat_trait
id: CO_321:0000142

Axiom
annotated source: stomatal size
annotated property: definition
annotated target: Measurement of stomata size in micrometers.
database_cross_reference: CO:rs

stomatal frequency
type: Class
subclass of: physiological trait
definition: Number of stomata counted per unit area on the leaf surface.
created by: RSHRESTHA
creation date: 2009-06-09T11:02:10Z
database_cross_reference: TO:0000566
has_obo_namespace: wheat_trait
id: CO_321:0000143

Axiom
annotated source: stomatal frequency
annotated property: definition
annotated target: Number of stomata counted per unit area on the leaf surface.
database_cross_reference: CO:rs

alveograph dough strength
type: Class
subclass of: quality trait
definition: Determination of dough strength by alveograph.
created by: RSHRESTHA
creation date: 2009-06-24T10:55:05Z
has_obo_namespace: wheat_trait
id: CO_321:0000144

Axiom
annotated source: alveograph dough strength
annotated property: definition
annotated target: Determination of dough strength by alveograph.
database_cross_reference: CIMMYT:jp
database_cross_reference: CO:rs

alveograph tenacity to extensibility ratio
type: Class
subclass of: quality trait
definition: Ratio of tenacity (p; maximum pressure required for the deformation of the sample) and extensibility (L; length of the curve) of dough.
created by: RSHRESTHA
creation date: 2009-06-24T10:56:27Z
has_obo_namespace: wheat_trait
id: CO_321:0000145

Axiom
annotated source: alveograph tenacity to extensibility ratio
annotated property: definition
annotated target: Ratio of tenacity (p; maximum pressure required for the deformation of the sample) and extensibility (L; length of the curve) of dough.
database_cross_reference: CIMMYT:jp
database_cross_reference: CO:rs

flour SDS-sedimentation
type: Class
subclass of: quality trait
definition: Testing of refined flour quality by SDS-sedimentation, a parameter estimating gluten strength or gluten protein quality.
created by: RSHRESTHA
creation date: 2009-06-24T10:57:45Z
has_obo_namespace: wheat_trait
id: CO_321:0000146

Axiom
annotated source: flour SDS-sedimentation
annotated property: definition
annotated target: Testing of refined flour quality by SDS-sedimentation, a parameter estimating gluten strength or gluten protein quality.
database_cross_reference: CIMMYT:jp
database_cross_reference: CO:rs

grain SDS-sedimentation
type: Class
subclass of: quality trait
definition: Testing of grain (whole meal flour) quality by SDS sedimentation a parameter estimating gluten strength or gluten protein quality.
created by: RSHRESTHA
creation date: 2009-06-24T10:58:47Z
has_obo_namespace: wheat_trait
id: CO_321:0000147

Axiom
annotated source: grain SDS-sedimentation
annotated property: definition
annotated target: Testing of grain (whole meal flour) quality by SDS sedimentation a parameter estimating gluten strength or gluten protein quality.
database_cross_reference: CO:rs

starchy endosperm
type: Class
subclass of: quality trait
definition: It refers to kernels showing chalky or starchy endosperm areas. Starchy endosperm areas are characterized for having low endosperm protein concentration.
created by: RSHRESTHA
creation date: 2009-06-24T11:04:32Z
has_obo_namespace: wheat_trait
id: CO_321:0000148

Axiom
annotated source: starchy endosperm
annotated property: definition
annotated target: It refers to kernels showing chalky or starchy endosperm areas. Starchy endosperm areas are characterized for having low endosperm protein concentration.
database_cross_reference: CIMMYT:jp
database_cross_reference: CO:rs

mixograph mixing time
type: Class
subclass of: quality trait
definition: Time required for the dough development from beginning of mixing flour and water to the dough reaches maximum consistency. It is expressed in minutes.
created by: RSHRESTHA
creation date: 2009-06-24T11:06:46Z
has_obo_namespace: wheat_trait
id: CO_321:0000149

Axiom
annotated source: mixograph mixing time
annotated property: definition
annotated target: Time required for the dough development from beginning of mixing flour and water to the dough reaches maximum consistency. It is expressed in minutes.
database_cross_reference: CIMMYT:jp
database_cross_reference: CO:rs

high molecular weight glutenin subunit composition (HMW-Glu)
type: Class
subclass of: quality trait
definition: Determination of high molecular weight of glutenin subunit composition in endosperm.
created by: RSHRESTHA
creation date: 2009-06-24T11:08:16Z
has_obo_namespace: wheat_trait
id: CO_321:0000150
comment: HMW glutenin subunits are essential for gluten elasticity and bread-making quality and Chinese noodle-making quality of wheat flour.

Axiom
annotated source: high molecular weight glutenin subunit composition (HMW-Glu)
annotated property: definition
annotated target: Determination of high molecular weight of glutenin subunit composition in endosperm.
database_cross_reference: CIMMYT:jp
database_cross_reference: CO:rs

low molecular weight glutenin subunit composition (LMW-Glu)
type: Class
subclass of: quality trait
definition: Determination of low molecular weight of glutenin subunit composition in endosperm.
created by: RSHRESTHA
creation date: 2009-06-24T11:19:05Z
has_obo_namespace: wheat_trait
id: CO_321:0000151

Axiom
annotated source: low molecular weight glutenin subunit composition (LMW-Glu)
annotated property: definition
annotated target: Determination of low molecular weight of glutenin subunit composition in endosperm.
database_cross_reference: CO:rs

HMW-Glu 1A
type: Class
subclass of: high molecular weight glutenin subunit composition (HMW-Glu)
created by: RSHRESTHA
creation date: 2009-06-24T11:33:58Z
has_obo_namespace: wheat_trait
id: CO_321:0000152

HMW-Glu 1B
type: Class
subclass of: high molecular weight glutenin subunit composition (HMW-Glu)
created by: RSHRESTHA
creation date: 2009-06-24T11:34:30Z
has_obo_namespace: wheat_trait
id: CO_321:0000153

HMW-Glu 1D
type: Class
subclass of: high molecular weight glutenin subunit composition (HMW-Glu)
created by: RSHRESTHA
creation date: 2009-06-24T11:34:50Z
has_obo_namespace: wheat_trait
id: CO_321:0000154

LMW-Glu 1A
type: Class
subclass of: low molecular weight glutenin subunit composition (LMW-Glu)
created by: RSHRESTHA
creation date: 2009-06-24T11:35:34Z
has_obo_namespace: wheat_trait
id: CO_321:0000155

LMW-Glu 1B
type: Class
subclass of: low molecular weight glutenin subunit composition (LMW-Glu)
created by: RSHRESTHA
creation date: 2009-06-24T11:36:03Z
has_obo_namespace: wheat_trait
id: CO_321:0000156

LMW-Glu 1D
type: Class
subclass of: low molecular weight glutenin subunit composition (LMW-Glu)
created by: RSHRESTHA
creation date: 2009-06-24T11:36:17Z
has_obo_namespace: wheat_trait
id: CO_321:0000157

1BL/1RS translocation
type: Class
subclass of: quality trait
created by: RSHRESTHA
creation date: 2009-06-24T11:53:57Z
has_obo_namespace: wheat_trait
id: CO_321:0000158

test weight
type: Class
subclass of: quality trait
definition: Is the weight (Kg) per one hectoliter of clean grain.
created by: RSHRESTHA
creation date: 2009-06-24T02:07:01Z
has_obo_namespace: wheat_trait
id: CO_321:0000159

Axiom
annotated source: test weight
annotated property: definition
annotated target: Is the weight (Kg) per one hectoliter of clean grain.
database_cross_reference: CIMMYT:jp
database_cross_reference: CO:rs

sedimentation index
type: Class
subclass of: quality trait
definition: SDS-sedimentation volume divided by protein percentage.
created by: RSHRESTHA
creation date: 2009-06-24T02:11:42Z
has_obo_namespace: wheat_trait
id: CO_321:0000160

Axiom
annotated source: sedimentation index
annotated property: definition
annotated target: SDS-sedimentation volume divided by protein percentage.
database_cross_reference: CIMMYT:jp

root-lesion nematode damage
type: Class
subclass of: nematode damage
created by: RSHRESTHA
creation date: 2009-08-12T03:03:04Z
has_obo_namespace: wheat_trait
id: CO_321:0000161

cytology related trait
type: Class
subclass of: CGIAR wheat trait ontology
created by: RSHRESTHA
creation date: 2009-12-09T04:56:41Z
has_obo_namespace: wheat_trait
id: CO_321:0000162

chromosome number
type: Class
subclass of: cytology related trait
created by: RSHRESTHA
creation date: 2009-12-09T04:57:08Z
has_obo_namespace: wheat_trait
id: CO_321:0000163

winter response
type: Class
subclass of: abiotic stress trait
definition: The trait is assessed in percentage for response to winter if winter kill or winter survival.
creation date: 2010-11-05T08:53:36Z
database_cross_reference: IWIS_TRAITID:1445
database_cross_reference: IWIS_TRAITID:1446
has_obo_namespace: wheat_trait
id: CO_321:0000164

Axiom
annotated source: winter response
annotated property: definition
annotated target: The trait is assessed in percentage for response to winter if winter kill or winter survival.
database_cross_reference: CO:rs

sterile index
type: Class
subclass of: agronomic trait
creation date: 2010-11-05T09:00:34Z
database_cross_reference: IWIS_TRAITID:1325
has_obo_namespace: wheat_trait
id: CO_321:0000165

spike per meter square
type: Class
subclass of: agronomic trait
definition: Count numbers of spike per meter square area.
creation date: 2010-11-05T09:02:15Z
database_cross_reference: IWIS_TRAITID:1157
has_obo_namespace: wheat_trait
has_related_synonym: spike/m2
id: CO_321:0000166

Axiom
annotated source: spike per meter square
annotated property: definition
annotated target: Count numbers of spike per meter square area.
database_cross_reference: CO:rs

lodging incidence
type: Class
subclass of: agronomic trait
definition: Indicates percentage of plants that lodged.
creation date: 2010-11-05T09:08:06Z
has_obo_namespace: wheat_trait
id: CO_321:0000167

Axiom
annotated source: lodging incidence
annotated property: definition
annotated target: Indicates percentage of plants that lodged.
database_cross_reference: CO:rs

fusarium wilt
type: Class
subclass of: fungal disease
definition: The trait is scored for the plant response to the agent Fusarium oxysporum causing fusarium wilt disease.
creation date: 2010-11-05T09:25:51Z
database_cross_reference: IWIS_TRAITID:1113
has_obo_namespace: wheat_trait
id: CO_321:0000168

Axiom
annotated source: fusarium wilt
annotated property: definition
annotated target: The trait is scored for the plant response to the agent Fusarium oxysporum causing fusarium wilt disease.
database_cross_reference: CO:rs

barley leaf rust
type: Class
subclass of: fungal disease
creation date: 2010-11-05T09:28:45Z
database_cross_reference: IWIS_TRAITID:1381
has_obo_namespace: wheat_trait
id: CO_321:0000169

net blotch
type: Class
subclass of: blotch
definition: The trait is scored for the plant response to the agent Pyrenophora teres causing net blotch.
creation date: 2010-11-05T09:30:23Z
database_cross_reference: IWIS_TRAITID:1083
has_obo_namespace: wheat_trait
id: CO_321:0000170

Axiom
annotated source: net blotch
annotated property: definition
annotated target: The trait is scored for the plant response to the agent Pyrenophora teres causing net blotch.
database_cross_reference: CO:rs

barley scald
type: Class
subclass of: fungal disease
definition: The trait is scored for the plant response to the agent Rhynchosporium secalis causing barley scald.
creation date: 2010-11-05T09:48:45Z
database_cross_reference: IWIS_TRAITID:1082
has_obo_namespace: wheat_trait
has_related_synonym: scald
id: CO_321:0000171

Axiom
annotated source: barley scald
annotated property: definition
annotated target: The trait is scored for the plant response to the agent Rhynchosporium secalis causing barley scald.
database_cross_reference: CO:rs

septoria blotch
type: Class
subclass of: blotch
definition: The trait is scored for the plant response to the agent Septoria species causing septoria blotch.
creation date: 2010-11-05T09:54:58Z
database_cross_reference: IWIS_TRAITID:1342
has_obo_namespace: wheat_trait
has_related_synonym: septoria species
id: CO_321:0000172

Axiom
annotated source: septoria blotch
annotated property: definition
annotated target: The trait is scored for the plant response to the agent Septoria species causing septoria blotch.
database_cross_reference: CO:rs

soil borne mosaic
type: Class
subclass of: viral disease
definition: The trait is scored for the plant response to the agent Soilborne Wheat Mosaic Virus (SBWMV)which is vectored by plasmodiophorid Polymyxa graminis causing soil borne mosaic.
creation date: 2010-11-05T09:57:34Z
database_cross_reference: IWIS_TRAITID:1440
has_obo_namespace: wheat_trait
id: CO_321:0000173

Axiom
annotated source: soil borne mosaic
annotated property: definition
annotated target: The trait is scored for the plant response to the agent Soilborne Wheat Mosaic Virus (SBWMV)which is vectored by plasmodiophorid Polymyxa graminis causing soil borne mosaic.
database_cross_reference: CO:rs

yellow berry
type: Class
subclass of: quality trait
creation date: 2010-11-05T10:13:17Z
database_cross_reference: IWIS_TRIATID:1128
has_obo_namespace: wheat_trait
id: CO_321:0000174

leaf tip necrosis
type: Class
subclass of: physiological trait
definition: A physiological phenomenon caused by hot, dry and windy weather. The whole tip of the flag leaf tends to be necrotic and will often fold over. Leaf tip necrosis progresses from the margins of the flag leaf tip and lower leaves as well show some signs of it. Leaf tip necrosis is observed to some extent in all wheat varieties containing the leaf rust gene resistance gene Lr34.
creation date: 2010-11-08T10:24:37Z
has_obo_namespace: wheat_trait
id: CO_321:0000175

Axiom
annotated source: leaf tip necrosis
annotated property: definition
annotated target: A physiological phenomenon caused by hot, dry and windy weather. The whole tip of the flag leaf tends to be necrotic and will often fold over. Leaf tip necrosis progresses from the margins of the flag leaf tip and lower leaves as well show some signs of it. Leaf tip necrosis is observed to some extent in all wheat varieties containing the leaf rust gene resistance gene Lr34.
database_cross_reference: CO:rs